{"text_format":"1","workbook":"xlsx","n_sheets":41,"sheets":["Revision Log","TOC","Printing Options","Instructions","Narrative","Controls","Project Description","QAP Reference","Unit Mix and Rents","Development Costs","Basis Calculation","Revenues and Expenses","Proforma","Selection Criteria","Summary","Checklist","Serious Problems","Reviewer Follow-Ups","Development Team","Syndication","Taxpayer Certification","Reserve Adequacy","App 1 Owner Info","App 2 Site Control","App 3 Ownership History","App 4 Zoning","App 11 NP Participation","App 13 NP Counsel Opinion","App 34 Debarment","App 35 Matching","App 36 Environmental","LHC-2 CEO Notification","LHC-3 Developer Experience","LHC-4 Management Experience","Existing LHC Property","Financing Cert","Demand Cert","Parishes","HUD TDC Data","AMI Rents","WS Controls"],"not_rendered":{"charts":0,"images":3,"macros":1,"external_links":0,"defined_names":160,"comments":0,"pivot_tables":0},"unopened":[],"bounds":{"document_bytes":16777216,"sheet_cells":100000,"rows_first":2000,"rows_last":500,"rows_between":2000,"halvings":0,"cell_chars":16384,"cell_head_chars":4096},"cells_cut":0,"cells_raw":0,"read":"whole","date_system":"1900"}

{"sheet":"Revision Log","index":0,"n_rows":92,"n_cols":4,"rows_kept":92,"cut":false,"hidden":true,"merged":[]}
[]
[]
[{"$f":"+Instructions!$A$3","v":"2025 QAP Underwriting Application v1.1"}]
[]
[{"$f":"\"Revision Log -- This is Version \"&D5","v":"Revision Log -- This is Version 16"},null,null,{"$f":"MAX(A8:A2172)","v":16}]
[]
["Version"]
[]
[0,"Converted from v32.  Changed title to include 'BETA'.\nIn Section 26, added guidance about ADRR trending.\nIn Section 16.07, if a non-zero Deferred Developer Fee is entered, a Checklist information request is triggered, to demonstrate reasonable repayability within 15 years.  Removed the Development Costs entry (Section 36.02) for DDF not repaid in 15 years.\nAdded a new 18.03 Construction Manager's Fee, with explanation.\nRevised 18.04 to clarify that GR/BO/BP are to be listed as related party costs if the GC is IOI.\nAdded a new Section 27 for Reserve funding, with additional questions about non-LHC requirements.\nIn Section 40, added an explanation that each profit / fee amount must fall below the applicable limit, for purposes of the application.\nAdded a new Appendix 52.31 inquiring about scope of rehab."]
[{"$f":"+A9+1","v":1},"Strong password protection."]
[2,"Instructions 1.08, 1.09, 1.10, 3.03 -- suggestions from F&J\nStaff unit instructions -- suggestion from F&J\n2019 QAP Pool structure.  First round of changes for 2019 Draft QAP."]
[3,"LINKED To v6 of the UW Model\nRemaining changes for 2019 Draft QAP (March 25 version).\nParish demographic data for 2019 Draft QAP."]
[4,"LINKED To v6 of the UW Model\nParish database updates: 2019 AMIs, 2019 FMRs, 2019 HOME rents.\nChanges in June 5 version of QAP (versus March 25 version), excluding Selection Criteria changes.\nAdd capability for boost in 4% projects.  Add capability for boost to Acquisition Basis (pending clarification from LHC).\nRemoved Entitlement Areas item (no NHTF funds in the 2019 QAP).\nWhere appropriate, bypass questions that are 9% only or that are specific to Other LHC Resources."]
[5,"LINKED To v6 of the UW Model\nSelection Criteria changes in June 5 version of 2019 QAP.\nAdded information message warning applicants who select non-zero boost for Acquisition Basis."]
[6,"LINKED To v6 of the UW Model\nEliminated the 2017 Import capability.  Updated the 2018 import settings.\nUpdated the QAP Reference worksheet."]
[{"$f":"+A15+1","v":7},"LINKED To v6 of the UW Model\nProgramming assumptions in areas where QAP is unclear.\nRobin's testing comments.\nAnker's comments on eligible basis and Applicable Fraction."]
[8,"LINKED To v6 of the UW Model\nAdded developer self-score columns to Selection Criteria worksheet, with logic to flag self-scores that differ from the calculated scores, and with logic to identify self-scores that exceed QAP limits.\n"]
[9,"LINKED To v6 of the UW Model\nRe-converted to BLANK data status.\n"]
[10,"Revisions to link Reserve Adequacy to input cells, rather than hidden rows 34:35"]
[11,"LINKED To v7 of the UW Model\nRemoved the former 34 point limit in Selection Criteria Section I.\nRemoved the former requirement for at least one point for Security.  Removed the associated Serious Problems flag.\nAdded Section 20.08 for excess costs excludable from the cost limit computation if LHC staff agree.   Added Appendix 52.28 to the Checklist.  Section 40: Subtract excess costs for cost limit computation purposes.  Section 41.05 Subtract excess costs for developer fee base computation purposes."]
[12,"LINKED To v8 of the UW Model\nDebugged the 2018 import capability.\n"]
[13,"LINKED To v9 of the UW Model.\nAnker's comments 2019-07-07 thru 09.\n"]
[14,"LINKED To v10 of the UW Model.\nDebugged the 2018 import routine.\n"]
[15,"Revised formulas to correct programming errors (Anker mid July)"]
[null,"Scoring Criteria D57 changed from \"=IF(M57>=46000,L57,0)\" to \"=IF(M57<=46000,L57,0)\""]
[null,"Scoring Criteria M55 changed from \"=VLOOKUP($O$51,Parishes!$A$9:$AD$73,28,FALSE)\" to \"=VLOOKUP($O$51,Parishes!$A$9:$AD$73,29,FALSE)\""]
[null,"Scoring Criteria M56 changed from \"==VLOOKUP($O$51,Parishes!$A$9:$AD$73,29,FALSE)\" to \"=VLOOKUP($O$51,Parishes!$A$9:$AD$73,28,FALSE)\""]
[null,"Development Costs C316 changed from \"=IF(C315<36,J316,IF(C315<71,K316,L316))\" to \"=IF(OR('Project Description'!H65=\"Yes\",'Project Description'!H68=\"Yes\"),18%,15%)\" This change eliminates the developer fee based on # of units, and replaces it with a 15% developer fee in all situations except one in which there is a NP or CHDO partner, which allows for an 18% developer fee"]
[null,"Project Description ROW 125, added question re: whether project was located in an area which is part of a concerted community revitalization plan (necessary as a component of qualifying for points under I.B."]
[null,"Scoring Criteria D14 changed from \"=IF('Project Description'!H134=\"Yes\",L14,0)\" to \"\n=IF(AND('Project Description'!$H$135=\"Yes\",'Project Description'!$H$123=\"Yes\",'Project Description'!$H$125=\"Yes\"),L16,0)\". Added similar logic to D15 and D16."]
[null,"Project Description L134 changed from \"=+L121+0.01\" to \"=+L129+0.01\""]
[null,"Reviewer Follow Up E16 changed from \"=IF('Project Description'!B528=\"\",\"\",\"Yes\")\" to =IF('Project Description'!H528=\"Yes\",\"Yes\",\"\")"]
[null,"Reviewer Follow Up E17 changed from \"=IF('Project Description'!B548=\"\",\"\",\"Yes\")\" to =IF('Project Description'!H548=\"Yes\",\"Yes\",\"\")"]
[null,"Reviewer Follow Up E26 changed from =IF(OR('Project Description'!B905=\"\",'Project Description'!B905=0),\"\",\"Yes\") to =IF('Project Description'!H904=\"Yes\",\"Yes\",\"\")"]
[null,"Revised formulas to correct programming errors (Charlie July 29)"]
[null,"Controls E157:E158 changed from 2.5 / 5 miles to 5 miles / 10 miles (QAP FAQ #9)"]
[null,"Appendix 36 YES / NO drop-downs corrected"]
[null,"Summary row 15 corrected to pull the self-score not the calculated score."]
[null,"Development Team D38 (sponsor email) unlocked."]
[]
[16,"Revised for 2020 PRIME -- linked to UW Model v11"]
[null,"Added an instruction about the 'links to external sources' message that users will receive when opening the Application."]
[null,"Eliminated former blank PD row 126; PD rows now match v14"]
[null,"Checklist Appendix 43 -- removed incorrect \"Yes\""]
[null,"Checklist Appendix 44 -- corrected the Yes/No formula"]
[null,"PD M117 FFIEC non-metro median income -- updated to 2019 data"]
[null,"Modifications to test adequacy of Surplus Cash to cover deferred developer fee (Proforma, Revenues & Expenses, and Project Description worksheets are affected)"]
[null,"PD 165 (Funding Pool) is pre-loaded as 'New Construction General'"]
[null,"$60M CDBG limit added; $10M CDBG per project limit added"]
[null,"FY 2020 FMRs added to Parishes database"]
[]
[]
[null,"To Do: Reveal all worksheets at start of Import routine, Hide Standard at the end."]
[null,"To Do: password-protect the VBA code (Anthony Allen email March 21)."]
[]
[]
[]
[null,"For Future QAPs: If NHTF funds offered, ask a question about Entitlement Areas."]
[null,"For Future QAPs: What to do about Op-Ex adequacy vs (a) prior audits for acquisition deals and (b) market study expenses"]
[null,"For future QAPs: If offering NHTF / HOME / CDBG, add questions about lien position."]
[]
[]
[null,"New Programmer Lrushing@lhc.la.gov 6/1/2020"]
[]
[null,"Added Table of Contents for easier navigation"]
[null,"Removed all $ so inserting rows would carry mapping with new cell references rather than hard coded"]
[null,"Added code to open to table of contents:"]
[null,"Private Sub Workbook_Open()\n    Sheets(\"TOC\").Select\n    Range(\"A1\").Select\nEnd Sub"]
[null,"Added code to disable ability to add new sheet:"]
[null,"Enable this code upon distribution\nPrivate Sub Workbook_NewSheet(ByVal Sh As Object)\n    Application.DisplayAlerts = False\n    Sh.Delete\nEnd Sub"]
[null,"Added code to module to determine if sheet is protected in order to protect or unprotect:"]
[null," Dim ws As Worksheet\nPrivate Function SheetProtected(TargetSheet As Worksheet) As Boolean\n     'Function purpose:  To evaluate if a worksheet is protected\n     \n    If TargetSheet.ProtectContents = True Then\n        SheetProtected = True\n    Else\n        SheetProtected = False\n    End If\n     \nEnd Function\nFunction DetermineSheetStatus(WSheet As Worksheet)\n    If SheetProtected(ws) Then\n        With ActiveWindow\n            .DisplayGridlines = False\n            .DisplayHeadings = False\n            .DisplayHorizontalScrollBar = True\n            .DisplayVerticalScrollBar = True\n            .DisplayWorkbookTabs = True\n        End With\n      Else\n        With ActiveWindow\n            .DisplayGridlines = False\n            .DisplayHeadings = True\n            .DisplayHorizontalScrollBar = True\n            .DisplayVerticalScrollBar = True\n            .DisplayWorkbookTabs = True\n        End With\n    End If\n End Function\n"]
[null,"Added code to each sheet to call above ^procedure and go to top of page when selected"]
[null,"On Error Resume Next\n    Sheets(\"NAME OF SHEET)\").Select\n    Range(\"A1\").Select\n    \n    Set ws = Activesheet\n    Call DetermineSheetStatus(ws)"]
[null,"Revised and added code to module in order to hide and protect for distribution"]
[null,"Revised and added code to module in order to unhide and unprotect for development"]
[null,"Sub HideStd()\n'\n' HideStd Macro\n'\n' Restore worksheets to standard hidden / revealed status; hide non-user columns and rows\n'\n    Application.ScreenUpdating = False\n    ControlSheet = \"WS Controls\"\n    NumWS = Sheets(ControlSheet).Range(\"D1\").Value\n    \n    Dim WSName As String\n    Dim Hide As String\n    Dim LastUserRow As Long\n    LastRow = 2000\n    Dim LastUserCol As Long\n    LastCol = 200\n    Dim LastColLtr As String\n    \n    For n = 1 To NumWS\n        WSName = Sheets(ControlSheet).Cells(n + 6, 1).Value\n        Hide = Sheets(ControlSheet).Cells(n + 6, 2).Value\n        LastUserRow = Sheets(ControlSheet).Cells(n + 6, 3).Value\n        LastUserCol = Sheets(ControlSheet).Cells(n + 6, 4).Value\n        On Error Resume Next\n        Sheets(WSName).Activate\n        Sheets(WSName).Cells.EntireColumn.Hidden = False\n        Sheets(WSName).Cells.EntireRow.Hidden = False\n\n        If Hide = \"Yes\" Then\n            Sheets(WSName).Visible = False\n        Else:\n            Sheets(WSName).Visible = True\n            Sheets(WSName).Activate\n            Sheets(WSName).Cells.EntireColumn.Hidden = False\n            Sheets(WSName).Cells.EntireRow.Hidden = False\n            Sheets(WSName).Range(Columns(LastUserCol), Columns(LastCol)).EntireColumn.Hidden = True\n            Sheets(WSName).Rows(\"\" & LastUserRow & \":\" & LastRow & \"\").EntireRow.Hidden = True\n            \n        End If\n    \n    Next n\n    Call sbProtectAllSheets\n    Application.ScreenUpdating = True\n\nEnd Sub\n\nSub sbProtectAllSheets()\n\n    Dim pwd1 As String, pwd2 As String\n    pwd1 = InputBox(\" \")\n    'If pwd1 = \"\" Then Exit Sub\n    pwd2 = InputBox(\" \")\n\n    'If pwd2 = \"\" Then Exit Sub\n\n     'Check if both the passwords are identical\n    If InStr(1, pwd2, pwd1, 0) = 0 Or _\n    InStr(1, pwd1, pwd2, 0) = 0 Then\n        MsgBox \"You entered different passwords. No action taken\"\n        Exit Sub\n    End If\n\n    For Each ws In Worksheets\n        ws.Protect Password:=pwd1\n    Next\n\n    MsgBox \"All sheets Protected.\"\n\n    Exit Sub\n    \nEnd Sub\n"]
[]
[null,"Revised and added code to module in order to hide and protect for development"]
[null,"Sub RevealAll()\n'\n' RevealAll Macro\n'\n' Restore all worksheets to full visibility\n'\n'\n'    Application.ScreenUpdating = False\n\n    Dim ws As Worksheet\n    Dim starting_ws As Worksheet\n    Set starting_ws = Activesheet\n    \n    For Each ws In ThisWorkbook.Worksheets\n        ws.Activate\n        'If ws.Visible = False Then\n            ws.Visible = True\n        'End If\n        On Error Resume Next\n        Columns.EntireColumn.Hidden = False\n        Rows.EntireRow.Hidden = False\n    Next\n        \n    Call sbUnProtectAll\n    \n    starting_ws.Activate\n    \n'    Application.ScreenUpdating = True\n\nEnd Sub\nSub sbUnProtectAll()\n  \n    On Error GoTo ErrorOccured\n   \n    Dim pwd1 As String\n    pwd1 = InputBox(\" \")\n    'If pwd1 = \"\" Then Exit Sub\n    For Each ws In Worksheets\n        ws.Unprotect Password:=pwd1\n    Next\n    MsgBox \"All sheets UnProtected.\"\n\n    Exit Sub\n     \nErrorOccured:\n    MsgBox \"Sheets could not be UnProtected - Password Incorrect\"\n    Exit Sub\n    \nEnd Sub\n\n\n"]
[null,"Added Region to Project Development row 62"]
[null,"Inserted row 85 in Project Development and added X, Y coordinates"]
[null,"Added =IFERROR(VLOOKUP(E82,Parishes!A10:U73,21,FALSE),\"\") to row M84 to handle error"]
[null,"Inserted rows  to Project Development row 159 To split federal funds and gov assist for comment section individually"]
[null,"Inserted rows  to Project Development row 160 To split federal funds and gov assist for comment section individually"]
[null,"Inserted rows  to Project Development row 161 To split federal funds and gov assist for comment section individually"]
[null,"Inserted rows 13 and 18 in Selection Criteria"]
[null,"Inserted rows 842 to 847 in Project Description and changed scoring numbers"]
[null,"Inserted rows 889 to 894 in Project Description and changed scoring numbers"]
[null,"IV. Location Characteristics\nAdded Entertainment Facility (movie theater, bowling alley, trampoline park, laser tag, etc.)\nAllowed applicants to Select all that apply for a max of 15 points\nV. C. Project Amenities\nAdded language to Exercise Room (must have equipment)\nReplaced Covered Parking with Off Street Parking\nAdded the following new selections\n  Patio or Balcony\n  Free Tenant Wifi\n  Tennis Court\n  Courtyard with Seating\n  Dog Park or Designated Pet Ares\n  Open Access Multi-Purpose Tenant Activity Room\nAllowed applicants to Select all that apply for a max of 14 points\n"]
[null,"Updated the Total Hard Costs to include the Builder Compensation on the Summary Tab.  The Builder Compensation line item can then be hidden or removed from the Summary Tab since it will be included in the Total Hard Costs.\n\n\nThe Total Hard Costs should now be the sum of the following line-items from the Development Cost Tab:\n• Construction Contract: Building Costs \n• Construction Contract: Site Work \n• Builder Compensation"]
[null,"2021 QAP Developer Fee Limit Calculation\na. For Rehabilitation projects the Developer Fee will not exceed thirty percent (30%) of the rehabilitation hard cost line‐item. \nb. For New Construction Projects the Developer Fee will not exceed $25,000 per LIHTC unit.  \n13. Developer Fees: The maximum Developer Fee is the amount determined below, $1,000,000.00, or $1,500,000.00 for projects utilizing tax‐exempt bonds. \n• For Rehabilitation projects the Developer Fee will not exceed thirty percent (30%) of the rehabilitation hard cost line‐item.\n•  For New Construction Projects the Developer Fee will not exceed $25,000 per LIHTC unit. c. Applications must include a Development Services Agreement. d. LHC will not allow increases to the developer fee as submitted in an application\n\n"]

{"sheet":"TOC","index":1,"n_rows":1,"n_cols":1,"rows_kept":1,"cut":false,"hidden":false,"merged":[[0,0,0,15]]}
["TABLE OF CONTENTS"]

{"sheet":"Printing Options","index":2,"n_rows":43,"n_cols":7,"rows_kept":43,"cut":false,"hidden":false,"merged":[[7,1,7,4],[41,1,41,4],[10,4,11,4]]}
[]
[]
[{"$f":"+Instructions!A3","v":"2025 QAP Underwriting Application v1.1"}]
[{"$f":"TRIM('Project Description'!E84)&\" (\"&TRIM('Project Description'!E86)&\" LA), \"&'Project Description'!E50","v":" ( LA), "}]
[null,{"$f":"COUNTA(B14:B40)","v":27},{"$f":"COUNTA(C14:C40)","v":14},{"$f":"COUNTA(D14:D40)","v":10},{"$f":"COUNTA(E14:E40)","v":4}]
["Printing Options"]
[]
[null,"Using this worksheet, you can create a single PDF file containing the selected worksheets.  The selected worksheets will appear in the order indicated below.  The PDF file will have the filename \"Exported Sheets.pdf\" and will be located in the same folder as this Application tool."]
[]
[]
[null,"Select Printing Option:","Option 2",null,"An error will occur if you skip a row in Option 3"]
[]
[null,"Worksheets Eligible for Automated Printing Selection","Option 1: Key Documents","Option 2: Key User Entry Sheets","Option 3: Custom Print **"]
[null,"Summary","Summary","Unit Mix and Rents","Syndication"]
[null,"Selection Criteria","Selection Criteria","Project Description","Financing Cert"]
[null,"Checklist","Checklist","Development Costs","Taxpayer Certification"]
[null,"Serious Problems","Serious Problems","Basis Calculation","App 1 Owner Info"]
[null,"Project Description","Syndication","Revenues and Expenses"]
[null,"Unit Mix and Rents","Taxpayer Certification","Proforma"]
[null,"Development Costs","App 1 Owner Info","Development Team"]
[null,"Basis Calculation","App 2 Site Control","Syndication"]
[null,"Revenues and Expenses","App 34 Debarment","Taxpayer Certification"]
[null,"Proforma","App 35 Matching","Financing Cert"]
[null,"Development Team","LHC-2 CEO Notification"]
[null,"Syndication","LHC-3 Developer Experience"]
[null,"Taxpayer Certification","LHC-4 Management Experience"]
[null,"App 1 Owner Info","Financing Cert"]
[null,"App 2 Site Control"]
[null,"App 3 Ownership History"]
[null,"App 4 Zoning",null,null,null,null,{"$f":"IF(C30=\"\",\"\",\", \"&C30)","v":""}]
[null,"App 11 NP Participation",null,null,null,null,""]
[null,"App 13 NP Counsel Opinion",null,null,null,null,""]
[null,"App 34 Debarment",null,null,null,null,""]
[null,"App 35 Matching",null,null,null,null,""]
[null,"App 36 Environmental",null,null,null,null,""]
[null,"LHC-2 CEO Notification",null,null,null,null,""]
[null,"LHC-3 Developer Experience",null,null,null,null,""]
[null,"LHC-4 Management Experience",null,null,null,null,""]
[null,"Financing Cert",null,null,null,null,""]
[null,"Demand Cert",null,null,null,null,""]
[]
[null,"** Select the desired worksheets, and the desired sequence for printing, from the drop down lists provided in the Option 3 column. "]
[null,"Other less common worksheets (e.g. Other Appendices) can be printed manually if desired."]

{"sheet":"Instructions","index":3,"n_rows":81,"n_cols":6,"rows_kept":81,"cut":false,"hidden":false,"merged":[]}
[]
[]
["2025 QAP Underwriting Application v1.1"]
["Matches the 2025 Final QAP (approved February 14, 2025)"]
["Instructions"]
[]
[{"$f":"\"Section \"&E7","v":"Section 1"},"General Instructions","QAP Reference",null,1]
[{"$f":"+E8","v":1.01},"In the event there is a conflict between this Application and the QAP, the QAP is the governing document.",{"$f":"+'QAP Reference'!A6","v":"II.B"},null,{"$f":"+E7+0.01","v":1.01}]
[1.02,"Note -- if your proposed transaction (a) requests bond financing and (b) does not request LIHTCs or Other LHC Resources, you may apply using the Bond Financing Application.",null,null,1.02]
[1.03,"Applicants are advised that materials contained in applications for the LIHTC Program are subject to the requirements of the Louisiana Public Records Request law (La R.S. 44:1 et seq.), and the application materials may be viewed and copied by any member of the public.",{"$f":"+'QAP Reference'!A7","v":"II.E"},null,{"$f":"+E9+0.01","v":1.03}]
[1.04,"Applicants are notified that any and all expenses incurred in the preparation of applications to be submitted during this round are incurred at their own risk and are subject to forfeiture.",{"$f":"+'QAP Reference'!A65","v":"V.C.3"},null,1.04]
[1.05,"It is the applicant's responsibility to notify the Corporation, in writing, of any occurrence of a reprocessing change in a Project. A reprocessing change may occur prior to delivery of Form 8609 to a Project; however, Form 8609 will be withheld until the Taxpayer submits a revised application and reprocessing fee. Following receipt of the revised application and reprocessing fee, the Corporation will complete a new legal, feasibility and viability review in order to determine any adjustment of maximum qualified basis and/or the tax credits to be allocated to the Project. Projects subject to reprocessing are at risk of credit loss if such Project fails to satisfy the minimum  score or if other projects on the waiting list which are not reserved credits have higher scores.",{"$f":"+'QAP Reference'!A85","v":"VI.C"},null,1.05]
[1.06,"Any Site Change may cancel any reservation, commitment or allocation of tax credits to such Project.",{"$f":"+'QAP Reference'!A86","v":"VI.C"},null,1.06]
[1.07,"Applicants are advised that awarded projects are expected to proceed and be completed in accordance with the awarded application, and that the completed project must conform to the awarded application.  See Section VI.D of the QAP.  The Applicant/Developer must notify the Corporation of any changes to the project, including but not limited to, unit mix and development type. It is the Applicant’s responsibility to provide required public notification of any such changes.",{"$f":"+'QAP Reference'!A87","v":"VI.C"},null,1.07]
[1.08,"Applications shall be evaluated using the preference and selection criteria as specifically cited in the QAP.  LHC reserves the right not to reserve tax credits to any Applicant for a Project, regardless of the Project’s score, and to recapture tax credits allocated to a project prior to delivery of IRS Form 8609 upon discovery of material misrepresentations or fraudulent statements made by an applicant or upon the occurrence of a material change.  In the event that the final scores of more than one Application are identical, LHC will implement the Tie‐breaking Procedures outlined in the Competitive Evaluation section of the QAP.",{"$f":"+'QAP Reference'!A89","v":"Appendix A"},null,1.08]
[]
[{"$f":"\"Section \"&E17","v":"Section 2"},"Using This Application Tool",null,null,{"$f":"+E7+1","v":2}]
[]
[{"$f":"+E19","v":2.0099999999999998},"Please do not alter the format of this Application: do not add or delete rows, do not add or delete columns, do not add or delete worksheets, do not move any worksheets, and do not re-name any worksheets. Please do not use the 'cut and paste' method anywhere within this Application (you may use the 'copy and paste' method). LHC will be using electronic methods to extract data from this Application for use in LHC's underwriting; if you have modified this Application in any way that interferes with LHC's ability to extract data for underwriting, LHC may reject the Application or, at LHC's discretion, LHC may return the Application for correction.",null,null,{"$f":"+E17+0.01","v":2.0099999999999998}]
[{"$f":"+E20","v":2.0199999999999996},"When opening this Application, you are likely to receive a message 'This workbook contains links to one or more external sources …'.  If you receive this message, select 'Don't Update'; the link is to a file that LHC used during development of the Application tool.",null,null,{"$f":"+E19+0.01","v":2.0199999999999996}]
[{"$f":"+E21","v":2.0299999999999994},"Worksheets that require user entries have tabs with medium blue background at the bottom of the screen.  LHC suggests that you complete these worksheets first, moving from left (Project Description) to right (Taxpayer Certification), before working on other worksheets (such as Appendices) that may be needed for your transaction.",null,null,{"$f":"+E20+0.01","v":2.0299999999999994}]
[{"$f":"+E22","v":2.0399999999999991},"Please limit your entries to cells with light blue background and dark blue bold font as shown below.  If you make entries in any other cells, this may result in LHC's inability to extract data for underwriting, which may result in rejection of your Application.",null,null,{"$f":"+E21+0.01","v":2.0399999999999991}]
[null,"User entry cells look like this"]
[{"$f":"+E24","v":2.0499999999999989},"Many user entry cells require you to select one of a fixed set of choices; this type of user entry cell will have a down arrow immediately to the right of the cell.  Following is an example of this type of user entry cell:",null,null,{"$f":"+E22+0.01","v":2.0499999999999989}]
[null,"Acquisition & Rehab"]
[{"$f":"+E26","v":2.0599999999999987},"Advisory messages appear throughout this Application in dark green font as shown below.",null,null,{"$f":"+E24+0.01","v":2.0599999999999987}]
[null,"Advisory messages look like this"]
[{"$f":"+E28","v":2.0699999999999985},"Any messages that appear in red bold italic font indicate serious problems; any such problems must be corrected or must otherwise be addressed in the application (for example, by a letter requesting a waiver).",null,null,{"$f":"+E26+0.01","v":2.0699999999999985}]
[null,"Serious problem messages look like this"]
[{"$f":"+E30","v":2.0799999999999983},"For narrative comment boxes (that look like the below), you can change the row height to accommodate additional explanation; see the examples below.",null,null,{"$f":"+E28+0.01","v":2.0799999999999983}]
[null,"Here is an example of a comment that fits in one row."]
[]
[null,"Here is an example of a much longer comment that requires multiple rows in order to display properly.  Additional information provided by applicant requires extra space.  Using the mouse, grab the line underneath the row number and drag that line downward to increase the row height."]
[]
[{"$f":"+E35","v":2.0899999999999981},"When there is a need to provide additional explanation beyond what will fit in this Application and its narrative comment boxes, please note that (a) Appendix 52 is one option for this type of additional explanation and that (b) there is a large narrative comment box at the end of the Project Description worksheet; the contents of this comment box will appear on the Summary worksheet.",null,null,{"$f":"+E30+0.01","v":2.0899999999999981}]
[{"$f":"+E36","v":2.0999999999999979},null,null,null,{"$f":"+E35+0.01","v":2.0999999999999979}]
[]
[{"$f":"\"Section \"&E38","v":"Section 3"},"Project Description Worksheet",null,null,{"$f":"+E17+1","v":3}]
[{"$f":"+E39","v":3.01},"This worksheet contains most of the user entries to describe the Taxpayer / Applicant and the project.",null,null,{"$f":"+E38+0.01","v":3.01}]
[{"$f":"+E40","v":3.0199999999999996},"Where appropriate, column J contains cross-references to the applicable QAP section(s).",null,null,{"$f":"+E39+0.01","v":3.0199999999999996}]
[{"$f":"+E41","v":3.0299999999999994},"Acquisition Housing Credit Rate.  LHC will underwrite at the rate in effect the month prior to the application submission due date, so the credit factor is subject to modification by LHC if the credit rate entered by the applicant is different from the rate in effect the month prior to application submission for 30% value credits. LHC will use a flat 9% rate for new construction and substantial rehabilitation projects without tax-exempt bond financing.",null,null,{"$f":"+E40+0.01","v":3.0299999999999994}]
[]
[{"$f":"\"Section \"&E43","v":"Section 4"},"Unit Mix and Rents Worksheet",null,null,{"$f":"+E38+1","v":4}]
[{"$f":"+E44","v":4.01},"Please note that each unit must have square footage, and number of bathrooms, at or above the LHC limit (that is, it is not acceptable to average the unit sizes). Accordingly, generally LHC expects you to include a row for each unique combination of: (1) number of bedrooms; (2) number of bathrooms; (3) square footage and (4) configuration / layout (for example, townhouse versus flat). Please also include a separate row for each staff unit. However, if the general approach outlined above would be burdensome, please contact LHC to explore whether there may be an alternative approach that will be workable for you and for LHC.",null,null,{"$f":"+E43+0.01","v":4.01}]
[{"$f":"+E45","v":4.0199999999999996},"The Unit Type column can be used to differentiate similar types of units.  Sample Unit Types might include: \"2BR Flat\", \"2BR Townhouse\", \"3BR LIHTC/HOME\", and \"1BR PSH\".",null,null,{"$f":"+E44+0.01","v":4.0199999999999996}]
[{"$f":"+E46","v":4.0299999999999994},"The Notes column will contain information in green bold font for any unit type that appears to have square footage, number of bathrooms, or rent that does not comply with applicable QAP requirements.",null,null,{"$f":"+E45+0.01","v":4.0299999999999994}]
[{"$f":"+E47","v":4.0399999999999991},{"$f":"\"If there are any unit type 'flags' in the Notes column, the Checklist worksheet will contain a question numbered Appendix \"&Checklist!E355&\".\"","v":"If there are any unit type 'flags' in the Notes column, the Checklist worksheet will contain a question numbered Appendix 52.13."},null,null,{"$f":"+E46+0.01","v":4.0399999999999991}]
[]
[{"$f":"\"Section \"&E49","v":"Section 5"},"Development Costs Worksheet",null,null,{"$f":"+E43+1","v":5}]
[{"$f":"+E50","v":5.01},"If any red bold italicized 'serious problem messages' appear, indicating violations of QAP fee and profit limits, you will need to adjust your development costs accordingly or to submit a waiver request to LHC.  ",null,null,{"$f":"+E49+0.01","v":5.01}]
[{"$f":"+E51","v":5.0199999999999996},"The section that calculates Adjusted Construction Basis subtracts amounts that LHC understands are generally excluded from construction basis.  If your advisors conclude that any of the formula deductions are inappropriate for your transaction, use one of the Adjustment rows to add back amounts as appropriate.  Also use the Adjustment rows to exclude other amounts as appropriate for your transaction.  ",null,null,{"$f":"+E50+0.01","v":5.0199999999999996}]
[{"$f":"+E52","v":5.0299999999999994},{"$f":"\"Extraordinary Site Costs (as defined in the QAP), if justified by the applicant and approved by LHC, will be deducted from Total Development Cost (TDC) before computing compliance with the TDC Per Unit Limit. See Section \"&F52&\" of this Application.\"","v":"Extraordinary Site Costs (as defined in the QAP), if justified by the applicant and approved by LHC, will be deducted from Total Development Cost (TDC) before computing compliance with the TDC Per Unit Limit. See Section 40 of this Application."},null,null,{"$f":"+E51+0.01","v":5.0299999999999994},{"$f":"+'Development Costs'!I231","v":40}]
[]
[{"$f":"\"Section \"&E54","v":"Section 6"},"Basis Calculation Worksheet",null,null,{"$f":"+E49+1","v":6}]
[{"$f":"+E55","v":6.01},"The lines titled 'Per Building Residential Area', 'Sqft of LIHTC Units', and 'Sqft of Total Units' should reflect only the square footage of residential units themselves.  Do not include square footage for staff units, common areas, or Community Service Facilities.",null,null,{"$f":"+E54+0.01","v":6.01}]
[{"$f":"+E56","v":6.02},"If any red bold italicized 'serious problem messages' appear at the bottom of this worksheet, you will need to correct the information in the worksheet. ",null,null,{"$f":"+E55+0.01","v":6.02}]
[]
[{"$f":"\"Section \"&E58","v":"Section 7"},"Revenues and Expenses Worksheet",null,null,{"$f":"+E54+1","v":7}]
[{"$f":"+E58+0.1","v":7.1},"This worksheet distinguishes between 'must-pay' expenses (that must be paid from operations regardless of availability of cash) and 'contingent' expenses (for example, expenses that are paid after year-end from excess cash).",null,null,{"$f":"+E58+0.01","v":7.01}]
[{"$f":"+A59+0.1","v":7.1999999999999993},null,null,null,{"$f":"+E59+0.01","v":7.02}]
[]
[{"$f":"\"Section \"&E62","v":"Section 8"},"Other Key Worksheets (Not Requiring User Entries)",null,null,{"$f":"+E58+1","v":8}]
[{"$f":"+E63","v":8.01},"Proforma Worksheet.  This worksheet charts revenue and expenses over time to see how a project performs financially.  This worksheet does not require any user entries, but you should make sure the project has sufficient debt coverage ratios and cash flow throughout whatever compliance period applies to the funding you seek (15 years for tax credits).  LHC requires a DCR of no less than 1.15 through Year 15 (exception: 1.10 DCR for Rural Housing Services (RHS) Rural Development funded properties).  If a LHC funding source, such as HOME, requires a longer compliance period and the DCR is not positive through year 20, an explanation must be provided on the Summary page detailing how the owner will handle the negative cash flow so that the project remains financially viable throughout the compliance period.",null,null,{"$f":"+E62+0.01","v":8.01}]
[8.02,{"$f":"\"Inflation or vacancy factors in the proforma can be modified in Section \"&'Project Description'!L950&\" of the Project Description worksheet.  Any departures from the LHC Standard factors must be justified and explained.\"","v":"Inflation or vacancy factors in the proforma can be modified in Section 28 of the Project Description worksheet.  Any departures from the LHC Standard factors must be justified and explained."},null,null,8.02]
[8.0299999999999994,"Selection Criteria Worksheet.  This worksheet shows the point score that your project would earn, if LHC agreed with the information you provided in this Application.",null,null,8.0299999999999994]
[8.0399999999999991,"Summary Worksheet.  This worksheet provides a two page overview of the project. The large comment box at the end comes from near the end of the Project Description worksheet.",null,null,8.0399999999999991]
[8.0499999999999989,"Checklist Worksheet. This worksheet shows the additional information (in addition to this Application) that is needed for the proposed project.  However, applicants must submit all information required under the QAP, whether or not that information is called for in the Checklist worksheet.",null,null,8.0499999999999989]
[8.0599999999999987,"Serious Problems Worksheet.  This worksheet shows each of the red bold italicized 'serious problem' messages in this Application. When you submit this Application, none of these message should remain (except possibly where you are requesting a waiver from LHC).",null,null,8.0599999999999987]
[]
[{"$f":"\"Section \"&E70","v":"Section 9"},"Other Instructions",null,null,{"$f":"+E62+1","v":9}]
[{"$f":"+E71","v":9.01},"Development Team, Syndication and Taxpayer Certification Worksheets. Each of these worksheets is required  to be completed.",null,null,{"$f":"+E70+0.01","v":9.01}]
[9.02,"Appendices.  Review the QAP, and the Checklist worksheet, to determine which Appendices should be completed and submitted for your proposed project.",null,null,9.02]
[9.0299999999999994,"LHC-2 (CEO Notification), LHC-3 (Developer Experience) and LHC-4 (Management Experience) Forms.  These are required for all projects.",null,null,9.0299999999999994]
[9.0399999999999991,"Financing Certification.  This worksheet is to be completed, signed and notarized, to memorialize the anticipated sources and uses of funds for the project.",null,null,9.0399999999999991]
[9.0499999999999989,"Demand Certification. This worksheet provides the format for a certification that the market study analyst must include in the Market Study report.",null,null,9.0499999999999989]
[9.0599999999999987,"Syndication Information & Certification.  This worksheet is to be completed, signed and notarized.",null,null,9.0599999999999987]
[9.0699999999999985,"Ownership Information.  This worksheet is to be completed, signed and notarized.",null,null,9.0699999999999985]
[9.0799999999999983,"Taxpayer Application Certification.  This worksheet is to be completed, signed and notarized.",null,null,9.0799999999999983]
[]
[]
[null,null,null,null,{"$f":"+E70","v":9},"= Last Section of this sheet"]

{"sheet":"Narrative","index":4,"n_rows":9,"n_cols":2,"rows_kept":9,"cut":false,"hidden":false,"merged":[[1,1,1,8],[3,1,3,8],[8,1,8,8],[10,1,36,8],[4,1,4,8],[5,1,5,8],[7,1,7,8]]}
[]
[null,{"$f":"+Instructions!$A$3 & \" Narrative\"","v":"2025 QAP Underwriting Application v1.1 Narrative"}]
[]
[null,"Project Name & Location:"]
[null,{"$f":"'Project Description'!E84 &\" - \" & 'Project Description'!E86 & \", Louisiana\"","v":" - , Louisiana"}]
[null,{"$f":"'Project Description'!E87 &\" Parish\"","v":"Select Parish"}]
[]
[null,"Submitted by:"]
[null,{"$f":"'Project Description'!E36","v":0}]

{"sheet":"Controls","index":5,"n_rows":245,"n_cols":8,"rows_kept":245,"cut":false,"hidden":true,"merged":[]}
[]
[]
[{"$f":"+Instructions!A3","v":"2025 QAP Underwriting Application v1.1"}]
["Controls"]
[]
["General"]
["Yes"]
["No"]
["Missing"]
[]
["Drop-Downs for Taxpayer"]
[]
["Limited Liability Company"]
["Limited Partnership"]
["'S' Corporation"]
["Other"]
["Missing"]
[]
["Controlled by For-Profit"]
["Controlled by Non-Profit"]
["Missing"]
[]
["Managing Member"]
["Manager"]
["General Partner"]
["Managing General Partner"]
["President"]
["Other"]
["Missing"]
[]
["Drop-Downs for Funding Pools","Advisory Message","Per Project Cap","NHTF","HOME","CDBG-DR","Short Name","Is Rural?"]
["Qualified Non‐Profit/CHDO Set-Aside","Requires the material participation of a qualified non-profit organization; see the QAP for documentation requirements.  ",{"$f":"IF($H$32=\"No\",1500000,1000000)","v":1000000},0,0,0,"QNP/CHDO",{"$f":"'Project Description'!H133","v":"Missing"}]
["Urban Area Pool    ","The project must be located in EBR, Orleans, Caddo, Ouachita, Calcasieu, Lafayette, St. Tammany, or Jefferson parishes.",1500000,0,0,0,"Urban"]
["Rural Area Rehabilitation Pool","The Rural project must be 50% or less new construction (by number of units).",1000000,0,0,0,"RuralRehab"]
["Rural Area New Construction Pool","The Rural project must be more than 50% new construction (by number of units).",1000000,0,0,0,"RuralNew"]
["Choice Neighborhood Initiative CNI Set-Aside","The project must be located in a CNI.",1500000,0,0,0,"CNI"]
["Reprocessing    ","LIHTC will be allocated to projects that have previously received and allocation.",null,0,0,0,"Reprocess"]
["Missing             "]
["Urban Area Rehabilitation Pool","The Urban project must be 50% or less new construction (by number of units).",1500000,0,0,0,"UrbanRehab"]
["Urban Area New Construction Pool","The Urban project must be more than 50% new construction (by number of units).",1500000,0,0,0,"UrbanNew"]
[]
["Drop-Downs for Project Type","Related Lookup Category for HUD TDC Limits"]
[]
["New Construction"]
["Acquisition & Rehab"]
["Adaptive Reuse"]
["Missing"]
[]
["Detached","Detached / Semi-Detached"]
["Detached / Semi-Detached","Detached / Semi-Detached"]
["Elevator","Elevator"]
["Missing","Walkup"]
["Other","Walkup"]
["Row","Row House"]
["Row House","Row House"]
["Semi-Detached","Detached / Semi-Detached"]
["Walkup","Walkup"]
["Walk-Up","Walkup"]
[]
["20/50"]
["40/60"]
["Average Income"]
["Missing"]
[]
["Drop-Downs for Sources of Funds"]
[]
["Fixed Rate"]
["Floating Rate"]
["Missing"]
[]
["Interest Only"]
["P+I"]
["P+I+MIP"]
["Missing"]
["Missing"]
["Must Pay"]
["All Pmts Deferred"]
["Pay if Cash Available"]
["Other (Explain)"]
[]
["Third Party"]
["Identity of Interest"]
["Missing"]
[]
["Amortizing"]
["Deferred; due at maturity"]
["Forgiven at maturity"]
["Missing"]
[]
["Permanent Hard Debt"]
["Permanent Soft Debt"]
["Grant"]
["Permanent Equity"]
["Other (Explain)"]
[]
["Donated / Volunteer Labor"]
["Donated Materials"]
["Donated Land Value"]
["NPV of Reduced RE Taxes"]
["Other (Explain)"]
[]
["Drop-Downs for HUD TDC Table"]
[]
["Alexandria",7]
["Baton Rouge",11]
["Lafayette",15]
["Lake Charles",19]
["Monroe",23]
["New Orleans",27]
["Shreveport",31]
["Missing",35]
[]
["Detached / Semi-Detached"]
["Row House"]
["Walkup"]
["Elevator"]
[]
["Drop-Downs for Utilities"]
[]
["Natural Gas"]
["Electric"]
["Propane"]
["Oil"]
["Other"]
["Missing"]
[]
["Natural Gas"]
["Electric"]
["Other"]
["Missing"]
[]
["Forced Air"]
["Hot Water"]
["Other"]
["Missing"]
[]
["Owner"]
["Tenant"]
["Missing"]
[]
["Drop-Downs for AMIs"]
[]
["120% AMI"]
["20% AMI"]
["30% AMI"]
["40% AMI"]
["50% AMI"]
["60% AMI"]
["70% AMI"]
["80% AMI"]
["Not AMI Restricted"]
[]
["Drop-Downs for Extended Affordability"]
[]
["Until after the 35th year"]
["Until after the 40th year"]
["Until after the 45th year"]
["Missing"]
[]
["Drop-Downs for Neighborhood Features"]
[]
[{"$f":"IF(G162=\"Rural\",E162,C162)","v":"Within 1 Mile Radius"},null,"Within 1 Mile Radius",null,"Within 5 Mile Radius",null,{"$f":"IF('Project Description'!H133=\"Yes\",\"Rural\",\"Not Rural\")","v":"Not Rural"}]
[{"$f":"IF(G162=\"Rural\",E163,C163)","v":"Within 2 Mile Radius"},null,"Within 2 Mile Radius",null,"Over 5 Mile Radius"]
["No"]
["Missing"]
[]
["Adjacent"]
["No",null,"Within 1/4 Mile Radius",null,"Within 1/2 Mile Radius",null,{"$f":"+'Project Description'!P138","v":5}]
["Missing"]
["Within 1/2 Mile Radius"]
[]
["Drop-Downs for Appendix 1"]
[]
["Requested"]
["Started Construction"]
["Finished Construction"]
["8609s"]
["Missing"]
[]
["Drop-Downs for Appendix 2"]
[]
["Purchase (please complete Section B below)"]
["Option to Purchase (please complete Section C below)"]
["Lease (please complete Section D below)"]
["Missing"]
[]
["LHC Application Fee"]
[]
["1-4 units",100,4]
["5-32 units",1000,32]
["33-60 units",1500,60]
["61-100 units",2500,100]
["Over 100 units",5000,{"$f":"+C192","v":100}]
[]
["LHC Analysis Fee"]
[]
["1-4 units",100,4]
["5-32 units",1000,32]
["33-60 units",1500,60]
["61-100 units",2500,100]
["Over 100 units",5000,{"$f":"+C200","v":100}]
[]
["Drop-Downs for Appendix 36"]
[]
["YES"]
[" "]
[]
["NO"]
[" "]
[]
["Drop-Downs for Import Tool"]
[]
["2018 AMEC"]
["2017 AMEC"]
["Early 2017 AMEC"]
["Other"]
[]
["Drop-Downs for CDBG Interest Rate"]
[]
[0]
[0.01]
["AFR"]
[]
["Drop-Downs for 'Other Worksheets'"]
[]
["Not Started"]
["In Process"]
["Completed"]
[]
["LHC Asset Management Fee"]
[]
["1-4 units",250,4]
["5-10 units",500,10]
["11-20 units",1000,20]
["21-50 units",2000,50]
["51-100 units",2500,100]
["101 units and over",3000,{"$f":"+C236","v":100}]
[]
[]
[]
["Green"]
["Green Building Basic"]
["Green Building Advanced"]
["No"]
["Missing"]

{"sheet":"Project Description","index":6,"n_rows":1071,"n_cols":201,"rows_kept":1071,"cut":false,"hidden":false,"merged":[[881,9,884,9],[891,9,901,9],[925,1,925,5],[926,1,926,5],[927,1,927,5],[928,1,928,5],[915,1,915,5],[922,1,922,7],[505,4,505,5],[507,1,507,7],[566,1,566,5],[599,1,599,5],[632,1,632,5],[694,1,694,7],[633,1,633,7],[634,1,634,7],[555,1,555,7],[552,1,552,5],[553,1,553,5],[561,1,561,5],[558,1,558,5],[593,1,593,7],[812,4,812,7],[636,1,636,5],[177,12,177,15],[158,1,158,7],[164,1,164,7],[177,1,177,7],[171,1,171,6],[504,4,504,5],[572,12,572,18],[371,4,371,5],[334,4,334,7],[335,4,335,5],[534,1,534,7],[547,1,547,7],[562,1,562,5],[538,1,538,5],[541,1,541,7],[549,1,549,7],[551,1,551,5],[475,4,475,5],[477,4,477,5],[457,4,457,5],[468,4,468,5],[361,4,361,5],[499,4,499,5],[503,4,503,5],[76,4,76,7],[138,1,138,6],[77,4,77,7],[930,1,930,5],[931,1,931,5],[882,1,882,5],[923,1,923,7],[581,1,581,7],[582,1,582,7],[584,1,584,5],[708,1,708,7],[723,1,723,7],[724,1,724,7],[86,4,86,5],[87,4,87,7],[157,1,157,7],[79,1,79,6],[141,1,141,6],[142,1,142,6],[144,1,144,6],[145,1,145,6],[140,1,140,6],[570,1,570,7],[451,4,451,5],[8,12,8,13],[12,1,12,7],[23,1,23,7],[10,1,10,5],[15,1,15,7],[75,4,75,7],[70,1,70,7],[73,1,73,7],[49,4,49,7],[42,4,42,7],[61,1,61,7],[50,4,50,7],[63,1,63,6],[35,4,35,7],[36,4,36,7],[37,4,37,7],[38,4,38,7],[39,4,39,7],[47,1,47,7],[43,4,43,7],[45,4,45,7],[67,1,67,7],[56,1,56,7],[137,12,137,14],[174,1,174,7],[153,1,153,6],[133,1,133,7],[88,12,88,15],[146,1,146,6],[151,1,151,6],[156,1,156,6],[163,1,163,6],[167,1,167,6],[143,1,143,6],[148,1,148,6],[147,1,147,6],[150,1,150,6],[168,1,168,7],[160,1,160,6],[161,1,161,6],[174,12,174,19],[149,1,149,6],[947,1,947,7],[1049,1,1049,7],[885,1,885,5],[909,1,909,5],[912,1,912,5],[826,1,826,5],[879,1,879,5],[981,1,981,5],[982,1,982,7],[969,1,969,7],[886,1,886,5],[976,1,976,5],[988,1,988,7],[972,1,972,7],[829,1,829,5],[872,1,872,7],[932,1,932,5],[887,1,887,5],[881,1,881,5],[884,1,884,5],[856,7,859,7],[212,12,212,20],[225,12,225,20],[460,4,460,7],[492,4,492,7],[206,1,206,5],[312,4,312,5],[189,1,189,7],[313,4,313,7],[190,1,190,7],[427,1,427,7],[431,4,431,5],[435,4,435,6],[436,4,436,7],[426,1,426,7],[414,1,414,7],[407,1,407,7],[341,4,341,7],[342,4,342,7],[353,4,353,5],[352,4,352,5],[390,1,390,7],[336,4,336,5],[337,4,337,5],[316,4,316,7],[1062,1,1062,7],[1064,1,1064,7],[951,1,951,5],[978,1,978,5],[1056,1,1056,5],[1053,1,1053,7],[1055,1,1055,7],[1058,1,1058,7],[437,4,437,5],[493,4,493,5],[478,4,478,7],[608,1,608,5],[594,1,594,5],[858,1,858,5],[824,1,824,5],[463,4,463,5],[449,4,449,6],[439,1,439,7],[450,4,450,7],[910,1,910,7],[913,1,913,7],[818,1,818,5],[822,1,822,5],[871,1,871,7],[187,1,187,7],[314,4,314,7],[220,1,220,7],[311,4,311,5],[294,4,294,5],[298,4,298,5],[302,4,302,5],[303,4,303,5],[304,4,304,5],[306,1,306,7],[310,4,310,5],[280,1,280,7],[196,1,196,7],[209,1,209,7],[309,4,309,7],[193,1,193,7],[195,1,195,7],[207,1,207,7],[284,1,284,7],[285,1,285,7],[178,1,178,7],[315,4,315,7],[215,1,215,7],[699,1,699,7],[609,1,609,5],[611,1,611,5],[612,1,612,5],[613,1,613,5],[615,1,615,7],[225,1,225,7],[395,4,395,5],[565,1,565,5],[461,4,461,5],[563,1,563,5],[564,1,564,5],[604,1,604,5],[605,1,605,5],[204,1,204,6],[212,1,212,7],[199,1,199,7],[328,4,328,5],[184,1,184,7],[496,4,496,7],[497,4,497,5],[7,1,7,5],[8,1,8,5],[17,1,17,5],[19,1,19,7],[20,1,20,7],[44,4,44,7],[88,4,88,7],[92,1,92,7],[13,1,13,7],[51,4,51,7],[69,1,69,6],[72,1,72,6],[52,1,52,6],[53,1,53,6],[65,1,65,6],[54,1,54,7],[40,4,40,7],[83,4,83,7],[84,4,84,7],[85,4,85,7],[41,4,41,7],[89,4,89,5],[58,1,58,6],[59,1,59,7],[814,1,814,5],[467,4,467,5],[471,1,471,7],[479,4,479,5],[712,2,712,6],[789,1,789,7],[700,1,700,5],[741,1,741,7],[747,3,747,4],[750,3,750,4],[751,3,751,4],[780,1,780,7],[769,2,769,6],[755,1,755,7],[802,1,802,5],[590,1,590,7],[575,1,575,7],[489,1,489,7],[620,1,620,5],[647,1,647,7],[659,1,659,6],[621,1,621,5],[616,1,616,7],[798,1,798,7],[768,1,768,7],[793,2,793,6],[791,1,791,7],[784,1,784,7],[785,2,785,6],[745,3,745,4],[746,3,746,4],[748,3,748,4],[618,12,618,21],[618,1,618,7],[481,4,481,5],[485,4,485,5],[486,4,486,5],[487,4,487,5],[495,4,495,5],[531,1,531,7],[532,1,532,7],[388,4,388,5],[376,4,376,6],[377,4,377,7],[387,4,387,5],[616,12,616,21],[615,12,615,21],[320,4,320,5],[327,4,327,5],[354,4,354,5],[356,1,356,7],[474,4,474,7],[382,4,382,5],[181,1,181,7],[425,4,425,5],[417,4,417,5],[411,4,411,5],[413,1,413,7],[420,1,420,7],[572,1,572,7],[386,4,386,5],[373,1,373,7],[343,4,343,5],[345,4,345,5],[183,1,183,7],[321,4,321,5],[324,4,324,5],[360,4,360,7],[365,4,365,5],[318,4,318,5],[340,4,340,7],[317,4,317,7],[331,1,331,7],[469,4,469,5],[453,1,453,7],[442,4,442,6],[443,4,443,7],[444,4,444,5],[446,1,446,7],[359,4,359,6],[329,4,329,5],[349,4,349,5],[378,4,378,5],[418,4,418,5],[346,4,346,5],[424,4,424,5],[456,4,456,7],[459,4,459,5],[338,4,338,7],[339,4,339,7],[369,4,369,5],[370,4,370,5]]}
[]
[]
[{"$f":"+Instructions!A3","v":"2025 QAP Underwriting Application v1.1"}]
["Description of the Proposed Project"]
[]
[{"$f":"\"Section \"&L6","v":"Section 10"},"Project Funding Characteristics",null,null,null,null,null,null,null,"QAP Reference",null,{"$f":"+Instructions!E81+1","v":10}]
[]
[{"$f":"+L8","v":10.01},"Tax-Exempt Bond Financing",null,null,null,null,null,null,null,null,null,{"$f":"+L6+0.01","v":10.01}]
[null,"Does the financing plan include tax-exempt bond financing?  ",null,null,null,null,null,"Missing",null,null,null,null,{"$f":"IF(H9=\"Yes\",\"Bonds\",\"No Bonds\")","v":"No Bonds"}]
[null,{"$f":"IF(H9=\"Yes\",\"Explain below\",\"Skip to Section \"&A23)","v":"Skip to Section 10.05"}]
[]
[{"$f":"+L12","v":10.02},"Does your transaction include 4% (\"30% PV\") LIHTCs?",null,null,null,null,null,"Missing",null,{"$f":"+'QAP Reference'!A24","v":"III.C"},null,{"$f":"+L8+0.01","v":10.02},{"$f":"IF(H12=\"Yes\",\"4% LIHTC + Bonds\",\"\")","v":""},null,null,{"$f":"IF(M12=\"\",\"\",IF(AND(M23=\"\",M30=\"\"),M12&\" only\",IF(M30=\"\",M12, M12&\", \")))","v":""}]
[null,{"$f":"IF(AND(H12=\"Yes\",H9<>\"Yes\"),\"Error -- 4% LIHTC transactions must use Tax Exempt Bond Financing\",\"\")","v":""}]
[null,"Indicate below the appropriate housing credit rate (typically more than 3.0% and less than 4.0%). This is published monthly by the Internal Revenue Service."]
[null,"The housing credit rate is estimated to be:",null,null,null,null,null,0]
[null,"Comment"]
[]
[{"$f":"+L18","v":10.029999999999999},"What are the estimated costs of issuance?",null,null,null,null,null,0,null,null,null,{"$f":"+L12+0.01","v":10.029999999999999}]
[]
[{"$f":"+L20","v":10.039999999999999},"Please explain below the role of tax-exempt bond financing in the financing plan, what governmental entity is planned to be the issuer, and the current state of your discussions with the issuer.",null,null,null,null,null,null,null,null,null,{"$f":"+L18+0.01","v":10.039999999999999}]
[null,"Comment"]
[]
[{"$f":"+L23","v":10.049999999999999},"Does your transaction include 9% (\"70% PV\") LIHTCs?",null,null,null,null,null,"Missing",null,{"$f":"+'QAP Reference'!A23","v":"III.B"},null,{"$f":"+L20+0.01","v":10.049999999999999},{"$f":"IF(H23=\"Yes\",\"9% LIHTC\",\"\")","v":""},null,null,{"$f":"IF(M23=\"\",\"\",IF(AND(M12=\"\",M30=\"\"),M23&\" only\",M23&\", \"))","v":""}]
[null,{"$f":"IF(AND(H23=\"Yes\",H9=\"Yes\"),\"Error -- cannot combine 9% LIHTCs and Tax Exempt Bond Financing\",\"\")","v":""}]
[]
[{"$f":"+L26","v":10.059999999999999},"Does your transaction include Other LHC Funding*?",null,null,null,null,null,"Missing",null,null,null,{"$f":"+L23+0.01","v":10.059999999999999}]
[null,"* HOME, NHTF or CDBG funding from LHC or from another State Agency"]
[null,{"$f":"IF(H26=\"Yes\",\"Note: The \" & Instructions!A3 & \" does not offer any HOME, NHTF or CDBG funding\",\"\")","v":""}]
[]
[{"$f":"+L30","v":10.069999999999999},"LHC Funding Type:",null,{"$f":"P23&P12&M30","v":""},null,null,null,null,null,null,null,{"$f":"+L26+0.01","v":10.069999999999999},{"$f":"IF(H26=\"Yes\",\"LHC Funds\",\"\")","v":""}]
[]
[null,{"$f":"IF(AND(H26=\"No\",H23=\"No\",H12=\"No\"),\"You may use the Bond Financing Application instead of this Application\",\"\")","v":""},null,null,null,null,null,null,null,null,null,null,{"$f":"IF(OR(H23=\"Yes\",H26=\"Yes\"),\"Pool\",\"Non Pool\")","v":"Non Pool"},null,null,"Pool = uses 9% LIHTCs or Other LHC Funds"]
[]
[{"$f":"\"Section \"&L34","v":"Section 11"},"Characteristics of The Applicant",null,null,null,null,null,null,null,"QAP Reference",null,{"$f":"+L6+1","v":11}]
[]
[{"$f":"+L36","v":11.01},"Taxpayer Name:",null,null,null,null,null,null,null,null,null,{"$f":"+L34+0.01","v":11.01}]
[null,"Taxpayer Address:"]
[null,"City, State & Zip:"]
[null,"Taxpayer Contact*:"]
[null,"Phone:"]
[null,"Email"]
[null,"Federal Tax ID / SSN:"]
[null,"Taxpayer is:"]
[null,"Taxpayer is a:"]
[null,"Controlling Principal Name:"]
[null,"Controlling Principal is the:"]
[]
[null,"* This person will be LHC's single point of contact for the taxpayer / applicant. Please be sure that this person will be a good choice to respond to any questions from LHC during underwriting."]
[]
[{"$f":"+L50","v":11.02},"Developer / Sponsor",null,null,null,null,null,null,null,"Glossary",null,{"$f":"+L36+0.01","v":11.02}]
[null,"Address:"]
[null,"City, State & Zip:"]
[null,"Does the Developer / Sponsor meet the requirements of QAP V.C.1?",null,null,null,null,null,"Missing",null,{"$f":"+'QAP Reference'!A62","v":"IV.C.1  "}]
[null,"Is the Developer a New Developer as defined in the QAP?",null,null,null,null,null,"Missing",null,{"$f":"+'QAP Reference'!A63","v":"IV.C.1 .e "}]
[null,{"$f":"IF(H54=\"Yes\",\"Note that, as a New Developer, you are only eligible to receive an award of tax credits for one project in this funding cycle.\",\"\")","v":""}]
[]
[null,"Comment"]
[]
[null,"Are you requesting credits for any other projects in this funding cycle?",null,null,null,null,null,"Missing",null,"II.B"]
[null,{"$f":"IF(H59=\"Yes\",\"No single developer will be awarded credits in excess of $3,000,000\",\"\")","v":""}]
[]
[null,"Comment"]
[]
[{"$f":"+L64","v":11.03},"Is there an Identity of Interest between the Developer and the Builder?",null,null,null,null,null,"Missing",null,"Glossary; \"Developer Fee Base\"",null,{"$f":"+L50+0.01","v":11.03}]
[]
[{"$f":"+L66","v":11.04},"Is any member of the proposed project team \"not in good standing\" with the LHC, as defined in the QAP?",null,null,null,null,null,"Missing",null,{"$f":"+'QAP Reference'!A66","v":"V.C.3"},null,{"$f":"+L64+0.01","v":11.04}]
[]
[null,"Comment"]
[]
[{"$f":"+L70","v":11.049999999999999},"Qualified Non-Profit. Does the Applicant evidence material participation of a Qualified Non-Profit Organization (as defined in the Glossary)?  If so, an information request will appear on the Checklist worksheet.",null,null,null,null,null,"Missing",null,{"$f":"'QAP Reference'!A9&\"; also Glossary\"","v":"II.A; also Glossary"},null,{"$f":"+L66+0.01","v":11.049999999999999}]
[null,{"$f":"IF(H70=\"Yes\",\"Consider applying in the nonprofit/CHDO funding pool\",\"\")","v":""},null,null,null,null,null,null,null,null,null,null,{"$f":"IF(H70=\"Yes\",\"Nonprofit\",\"\")","v":""}]
[]
[{"$f":"+L73","v":11.059999999999999},"CHDO. Is the Applicant a CHDO (Community Housing Development Organization) that (a) meets the definition in the Glossary and (b) is certified as a CHDO by the LHC? If so, an information request will appear on the Checklist worksheet.",null,null,null,null,null,"Missing",null,{"$f":"'QAP Reference'!A10&\"; also Glossary\"","v":"II.A; also Glossary"},null,{"$f":"+L70+0.01","v":11.059999999999999},null,null,"commitments"]
[null,{"$f":"IF(H73=\"Yes\",\"Consider applying in the nonprofit/CHDO funding pool\",\"\")","v":""},null,null,null,null,null,null,null,null,null,null,{"$f":"IF(H73=\"Yes\",\"CHDO\",\"\")","v":""}]
[]
[{"$f":"+L76","v":11.069999999999999},"Management Agent",null,null,null,null,null,null,null,null,null,{"$f":"+L73+0.01","v":11.069999999999999}]
[null,"Street Address:"]
[null,"City, State, Zip:"]
[]
[{"$f":"+L80","v":11.079999999999998},"Does the management agent have an identity of interest with the applicant or with the developer?",null,null,null,null,null,"Missing",null,null,null,{"$f":"+L76+0.01","v":11.079999999999998}]
[]
[{"$f":"\"Section \"&L82","v":"Section 12"},"Characteristics of The Project ",null,null,null,null,null,null,null,"QAP Reference",null,{"$f":"+L34+1","v":12}]
[]
[{"$f":"+L84","v":12.01},"Project Name:",null,null,null,null,null,null,null,null,null,{"$f":"+L82+0.01","v":12.01}]
[null,"Street Address:"]
[null,"City:"]
[null,"Parish:",null,null,"Select",null,"Region:",{"$f":"IF(OR(ISERROR(M87),M87=\"\",M87=0),\"Not found - please select Parish\",M87)","v":"Not found - please select Parish"},null,null,1,null,{"$f":"IFERROR(VLOOKUP($E$87,Parishes!$A$10:$X$73,22,FALSE),\"\")","v":""},null,null,null,{"$f":"VLOOKUP(E87,Parishes!A10:W73,2,FALSE)","v":{"$error":"#N/A"}},"50% AMI for the Parish"]
[null,"Zip Code:"]
[null,"MSA:",null,null,{"$f":"IF(OR(ISERROR(M89),M89=0),\"Not located in an MSA\",IF(M89=\"\",\"Not found - Please select a Parish above\",M89))","v":"Not found - Please select a Parish above"},null,null,null,null,null,null,null,{"$f":"IFERROR(VLOOKUP(E87,Parishes!A10:W73,21,FALSE),\"\")","v":""},null,null,null,{"$f":"VLOOKUP(E87,Parishes!A10:W73,20,FALSE)","v":{"$error":"#N/A"}},"100% AMI for the MSA"]
[null,"Coordinates:",null,"X:  ",null,null,"Y:  "]
[]
[{"$f":"+L92","v":12.02},"Is the entire project located on a single site?",null,null,null,null,null,"Missing",null,null,null,{"$f":"+L84+0.01","v":12.02}]
[null,{"$f":"IF(H92=\"Yes\",\"\",\"The Checklist worksheet will include a question.\")","v":"The Checklist worksheet will include a question."}]
[]
[{"$f":"+L95","v":12.03},"What is the primary development type?",null,null,null,null,null,"Missing",null,null,null,{"$f":"+L92+0.01","v":12.03}]
[null,"Will any new construction take place?",null,null,null,null,null,"Missing"]
[null,"Percentage of new construction (by # of units*)",null,null,null,null,null,"Missing",null,null,null,null,{"$f":"IF(H97>50%,S178,R178)","v":"UrbanNew"}]
[null,"* Number of new construction units in the project ÷ number of total units in the project"]
[]
[{"$f":"+L100","v":12.04},"Will any existing buildings be acquired?",null,null,null,null,null,"Missing",null,null,null,{"$f":"+L95+0.01","v":12.04}]
[null,"Will any existing residential buildings be acquired?",null,null,null,null,null,"Missing"]
[null,"Will any existing non-residential buildings be acquired?",null,null,null,null,null,"Missing"]
[null,"Will any rehabilitation take place?",null,null,null,null,null,"Missing"]
[null,"Will Substantial Rehabilitation take place?",null,null,null,null,null,"Missing"]
[null,"Will any historic rehabilitation take place?",null,null,null,null,null,"Missing"]
[]
[{"$f":"+L107","v":12.049999999999999},"Does the purchase price of the real estate exceed 500K?",null,null,null,null,null,"Missing",null,{"$f":"+'QAP Reference'!A82","v":"IV.B.6"},null,{"$f":"+L100+0.01","v":12.049999999999999}]
[null,"Will Acquisition Cost of buildings be included in basis?",null,null,null,null,null,"Missing",null,{"$f":"+'QAP Reference'!A82","v":"IV.B.6"}]
[]
[{"$f":"+L110","v":12.059999999999999},"Will any existing rental housing buildings be acquired?",null,null,null,null,null,"Missing",null,null,null,{"$f":"+L107+0.01","v":12.059999999999999}]
[null,"If so, are the seller and purchaser Related Persons?",null,null,null,null,null,"Missing",null,{"$f":"'QAP Reference'!A60&\"; also Glossary\"","v":"IV.B.2; also Glossary"}]
[]
[{"$f":"+L113","v":12.069999999999999},"Is this an infill project (as defined in the QAP)?",null,null,null,null,null,"Missing",null,"Glossary",null,{"$f":"+L110+0.01","v":12.069999999999999}]
[null,"Is the project located in a Special Flood Hazard Area?",null,null,null,null,null,"Missing",null,{"$f":"+'QAP Reference'!A49","v":"IV.A.13"}]
[null,"Is the project in a levee protected area?",null,null,null,null,null,"Missing",null,{"$f":"+'QAP Reference'!A49","v":"IV.A.13"}]
[]
[{"$f":"+L117","v":12.079999999999998},"What is the primary building type for this project?",null,null,null,null,null,"Missing",null,null,null,{"$f":"+L113+0.01","v":12.079999999999998}]
[null,"Does the project include other building types as well?",null,null,null,null,null,"Missing"]
[]
[{"$f":"+L120","v":12.089999999999998},"In which census tract is the project primarily located?",null,null,null,null,null,"Missing",null,null,null,{"$f":"+L117+0.01","v":12.089999999999998}]
[null,"Does any part of the project lie outside this census tract?",null,null,null,null,null,"Missing"]
[null,"If so, what % of the units are in this census tract?",null,null,null,null,null,0]
[null,"Median income of the primary census tract",null,null,null,null,null,"Missing",null,{"$f":"+'QAP Reference'!A20","v":"II.C"},null,null,56600,"FFIEC non-metro 2021 median income"]
[null,"Median income of the MSA",null,null,null,null,null,{"$f":"IFERROR(IF(Q89=0,M123,Q89),\"Parish required on Row 87\")","v":"Parish required on Row 87"},null,null,null,null,{"$f":"+H123/H124","v":{"$error":"#VALUE!"}},"(Census Tract income as % of MSA)"]
[null,"Median income of the Parish",null,null,null,null,null,{"$f":"IFERROR(Q87*2,\"Parish required on Row 87\")","v":"Parish required on Row 87"},null,null,null,null,{"$f":"+H123/H125","v":{"$error":"#VALUE!"}},"(Census Tract income as % of Parish)"]
[]
[{"$f":"+L127","v":12.099999999999998},"Is any part of the project located in:",null,null,null,null,null,null,null,null,null,{"$f":"+L120+0.01","v":12.099999999999998}]
[null,"…  a Difficult Development Area?",null,null,null,null,null,"Missing",null,"Glossary"]
[null,"…  a Qualified Census Tract?",null,null,null,null,null,"Missing",null,"Glossary"]
[null,"…  a Federally recognized or State recognized Tribal Organization?",null,null,null,null,null,"Missing",null,"Glossary"]
[null,"… a Choice Neighborhood Initiative census tract?",null,null,null,null,null,"Missing"]
[null,"… an area part of a Concerted Community Revitalization Plan?",null,null,null,null,null,"Missing",null,"Glossary"]
[{"$f":"+L133","v":12.109999999999998},"Is this a Rural Area Project, as defined in the QAP?",null,null,null,null,null,"Missing",null,"Glossary",null,{"$f":"+L127+0.01","v":12.109999999999998}]
[null,{"$f":"IF(H133=\"Yes\",\"Note that there are rural set-asides within the Rehab and NC funding pools\",\"\")","v":""},null,null,null,null,null,null,null,null,null,null,{"$f":"IF(H133=\"Yes\",\"Rural\",\"\")","v":""}]
[]
[{"$f":"+L136","v":12.119999999999997},"Is the project located within an incorporated area (town, city)?",null,null,null,null,null,"Missing",null,null,null,{"$f":"+L133+0.01","v":12.119999999999997}]
[null,"If so, what is the population of the incorporated area?",null,null,null,null,null,"Missing"]
[null,"Is the project located in a Urban Area?",null,null,null,null,null,"Missing",null,null,null,null,{"$f":"IF(H138=\"Yes\",\"Urban Area\",IF(H139=\"Yes\",\"Small Town or City\",IF(H133=\"Yes\",\"Rural\",\"\")))","v":""},null,null,{"$f":"IF(M138=\"Dense Urban Area\",1,IF(M138=\"Small Town or City\",2,IF(M138=\"Other Incorporated\",3,IF(M138=\"Rural\",4,5))))","v":5},{"$f":"IF(P138=6,\"Error -- programming problem\",\"\")","v":""}]
[null,"Is the project located in a Town or City with a population of 15,000 or less?",null,null,null,null,null,"Missing",null,{"$f":"+J138","v":0}]
[]
[{"$f":"+L141","v":12.129999999999997},"Is the property a Distressed Property, as defined in the QAP (RD, HUD or PHA)?",null,null,null,null,null,"Missing",null,"Glossary",null,{"$f":"+L136+0.01","v":12.129999999999997}]
[12.139999999999997,"Is this a Redevelopment Property, as defined in the QAP?",null,null,null,null,null,"Missing",null,"Glossary",null,{"$f":"+L141+0.01","v":12.139999999999997}]
[12.149999999999997,"Is the property an Owner Occupied Property with Development Plan of Action, as defined in the QAP?",null,null,null,null,null,"Missing",null,"Glossary",null,12.149999999999997]
[12.159999999999997,"Is this an Existing LIHTC Project, as defined in the QAP?",null,null,null,null,null,"Missing",null,null,null,12.159999999999997,{"$f":"IF(H144=\"no\",\"\",\"IF yes please compete the Existing LHC Property Tab\")","v":"IF yes please compete the Existing LHC Property Tab"},null,null,null,{"$f":"H144","v":"Missing"}]
[12.169999999999996,"Is this a rehabilitation of existing USDA, or Federally Funded project?  This would include (for example) any project receiving Section 8, RD Rental Assistance, HOME, CDBG, or public housing funding; or that has a mortgage loan with a federally subsidized interest rate.",null,null,null,null,null,"Missing",null,null,null,12.169999999999996]
[12.179999999999996,"Is this a rehab of an existing non-historic residential building?",null,null,null,null,null,"Missing",null,null,null,12.179999999999996]
[12.189999999999996,"Does this project constitute Blighted housing remediation and/or replacement, as defined in the QAP?",null,null,null,null,null,"Missing",null,"Glossary",null,12.189999999999996]
[12.199999999999996,"Is this a Rehab Infill / Scattered Site Project, as defined in the QAP?",null,null,null,null,null,"Missing",null,null,null,12.199999999999996]
[12.209999999999996,"Is this Preservation of Residential Historic Property, as defined in the QAP?",null,null,null,null,null,"Missing",null,null,null,12.209999999999996]
[12.219999999999995,"Is this an Existing Federally Funded Project with HAP Contract, or USDA with PBRA, as defined in the QAP?",null,null,null,null,null,"Missing",null,null,null,12.219999999999995]
[12.229999999999995,"Is this a New Construction Infill / Scattered Site Project, as defined in the QAP?",null,null,null,null,null,"Missing",null,null,null,12.229999999999995]
[12.239999999999995,"Is this a Homeownership project, as defined in the QAP?",null,null,null,null,null,"Missing",null,"Glossary",null,12.239999999999995]
[]
[{"$f":"+L154","v":12.249999999999995},"Does the Taxpayer agree to give preference to Veterans, Disabled and Elderly persons on the PHA waiting list if they satisfy the requirements of the Project’s Management and/or Operating Plan?",null,null,null,null,null,"Missing",null,{"$f":"+'QAP Reference'!A13","v":"IV.A.2.a"},null,{"$f":"+L152+0.01","v":12.249999999999995}]
[null,{"$f":"IF(H154=\"Yes\",\"\",IF(H154=\"Missing\",\"\",\"Error -- the QAP requires this preference for PHA waiting list applicants\"))","v":""}]
[]
[{"$f":"+L157","v":12.259999999999994},"Is this a Preservation Property, as defined in the QAP?",null,null,null,null,null,"Missing",null,"VII.D, Glossary",null,{"$f":"+L154+0.01","v":12.259999999999994}]
[null,{"$f":"IF(AND(H157=\"Yes\",H95=Controls!A44),\"Note: This is a New Construction property; explain why you believe it is eligible as a Preservation Property under the QAP.\",\"\")","v":""}]
[null,null,null,null,null,null,null,null,null,null,null,null,{"$f":"IF(H157=\"Yes\",\"Preservation\",\"\")","v":""}]
[]
[{"$f":"+L161","v":12.269999999999994},"Is this a Single Room Occupancy (SRO) Project, as defined in the QAP?",null,null,null,null,null,"Missing",null,{"$f":"+'QAP Reference'!A72","v":"IV.D"},null,{"$f":"+L157+0.01","v":12.269999999999994}]
[null,"Is this a Project Reallocated Credits Based on Housing Discrimination, as defined in the QAP?",null,null,null,null,null,"Missing",null,{"$f":"+'QAP Reference'!A73","v":"IV.D"}]
[]
[{"$f":"+L164","v":12.279999999999994},"Does the project currently receive federal funds and/or receive insurance under a federal program?",null,null,null,null,null,"Missing",null,{"$f":"+'QAP Reference'!A80","v":"IV.A"},null,{"$f":"+L161+0.01","v":12.279999999999994}]
[null,"Comment"]
[null,{"$f":"IF(AND(B165=\"\",H164=\"Yes\"),\"An explanation is required; the Checklist will include an information request.\",\"\")","v":""}]
[]
[null,"Will HUD or RD housing assistance, or other government assistance, be provided to the project?",null,null,null,null,null,"Missing"]
[null,"Comment"]
[null,{"$f":"IF(AND(B169=\"\",H168=\"Yes\"),\"An explanation is required; the Checklist will include an information request.\",\"\")","v":""}]
[]
[{"$f":"+L172","v":12.289999999999994},"Is this a PHA sponsored project?",null,null,null,null,null,"Missing",null,"Glossary",null,{"$f":"+L164+0.01","v":12.289999999999994}]
[]
[{"$f":"\"Section \"&L174","v":"Section 13"},"Selection of Funding Pool; Requests for Funding Other Than LIHTCs",null,null,null,null,null,null,null,"QAP Reference",null,{"$f":"+L82+1","v":13}]
[null,{"$f":"IF(OR(H23=\"Yes\",H26=\"Yes\"),\"Complete this Section\",\"Skip to Section \"&L199)","v":"Skip to Section 14"},null,null,null,null,null,null,null,null,null,null,"Logic to identify for which pool(s) this project may be eligible"]
[]
[{"$f":"+L177","v":13.01},"For which funding pool are you applying?",null,null,null,null,null,"Missing             ",null,{"$f":"'QAP Reference'!A11","v":"II.A"},null,{"$f":"+L174+0.01","v":13.01},{"$f":"MATCH(H177,Controls!A32:A36,0)","v":{"$error":"#N/A"}}]
[null,{"$f":"IF(ISNA(INDEX(Controls!A32:C36,M177,2))=TRUE,\"\",INDEX(Controls!A32:C36,M177,2))","v":""},null,null,null,null,null,null,null,null,null,null,{"$f":"IF(Q180=0,\"\",IF(Q180<4,Q178,IF(Q180=4,R178,IF(Q180<8,Q178&\" and \"&R178,IF(Q180=8,S178,IF(Q180<12,Q178&\" and \"&S178,IF(Q180=12,R178&\" and \"&S178,Q178&\", \"&R178&\" and \"&S178)))))))","v":"UrbanRehab"},null,null,null,{"$f":"+Controls!G32","v":"QNP/CHDO"},{"$f":"+Controls!G39","v":"UrbanRehab"},{"$f":"+Controls!G40","v":"UrbanNew"},{"$f":"+Controls!G34","v":"RuralRehab"}]
[null,{"$f":"IF(H177<>\"General\",\"\",IF('Project Description'!M178=\"\",\"\",\"You selected the General pool, but your proposed project likely is eligible for \"&M178&\"; please consider pool selection carefully.\"))","v":""},null,null,null,null,null,null,null,null,null,null,{"$f":"IF(M71<>\"\",M71,IF(M74<>\"\",M74,\"\"))","v":""},{"$f":"IF(M97=R178,R178,\"\")","v":""},{"$f":"IF(M97=S178,S178,\"\")","v":"UrbanNew"}]
[null,null,null,null,null,null,null,null,null,null,null,null,{"$f":"IF(M179=\"\",0,1)","v":0},{"$f":"IF(N179=\"\",0,2)","v":0},{"$f":"IF(O179=\"\",0,4)","v":4},{"$f":"IF(P179=\"\",0,8)","v":0},{"$f":"SUM(M180:P180)","v":4}]
[{"$f":"+L181","v":13.02},"National Housing Trust Fund (NHTF)",null,null,null,null,null,null,null,null,null,{"$f":"+L177+0.01","v":13.02},{"$f":"INDEX(Controls!A32:D36,M177,4)","v":{"$error":"#N/A"}},"NHTF available in selected pool"]
[null,{"$f":"IF(ISNA(IF(M181=0,\"No NHTF funds are available for award to projects in the pool you selected.\",IF(M184=0,\"NHTF funds are not available to CHDOs or to projects in Entitlement Areas.\",\"This project may apply for up to \"&TEXT(M182,\"#,##0\")&\" per project in NHTF funds.\")))=TRUE,\"\",IF(M181=0,\"No NHTF funds are available for award to projects in the pool you selected.\",IF(M184=0,\"NHTF funds are not available to CHDOs or to projects in Entitlement Areas.\",\"This project may apply for up to \"&TEXT(M182,\"#,##0\")&\" per project in NHTF funds.\")))","v":""},null,null,null,null,null,null,null,null,null,null,0,"NHTF Per Project Cap"]
[null,"Amount of NHTF funds requested:",null,null,null,null,null,0,null,null,null,null,0,"If CHDO "]
[null,{"$f":"IF(H183<0,\"Negative amount not allowed\",IF(H183>M184,\"Exceeds maximum allowable amount\",\"\"))","v":""},null,null,null,null,null,null,null,null,null,null,{"$f":"IF(H73=\"Yes\",0,M182)","v":0},"Per Project Cap for This Project"]
[null,{"$f":"IF(H183=0,\"\",\"Note that any project receiving NHTF will require Environmental Review which can take up to 120 days to complete.\")","v":""}]
[]
[{"$f":"+L187","v":13.03},"HOME Investment Partnership Program Funds (HOME)",null,null,null,null,null,null,null,null,null,{"$f":"+L181+0.01","v":13.03},{"$f":"INDEX(Controls!A32:E36,M177,5)","v":{"$error":"#N/A"}},"HOME available in selected pool"]
[null,{"$f":"IF(ISNA(IF(M187=0,\"No HOME funds are available for award to projects in the pool you selected.\",IF(H73<>\"Yes\",\"HOME funds are available only to LHC-certified CHDOs.\",\"CHDO applicants in this pool may apply for up to \"&TEXT(M182,\"#,##0\")&\" per project in HOME funds.\")))=TRUE,\"\",IF(M187=0,\"No HOME funds are available for award to projects in the pool you selected.\",IF(H73<>\"Yes\",\"HOME funds are available only to LHC-certified CHDOs.\",\"CHDO applicants in this pool may apply for up to \"&TEXT(M182,\"#,##0\")&\" per project in HOME funds.\")))","v":""},null,null,null,null,null,null,null,null,null,null,0,"NHTF Per Project Cap"]
[null,"Amount of HOME funds requested:",null,null,null,null,null,null,null,null,null,null,{"$f":"IF(H73<>\"Yes\",0,M188)","v":0},"Per Project Cap for This Project"]
[null,{"$f":"IF(H189<0,\"Negative HOME amount not allowed\",IF(H189>M190,\"HOME exceeds maximum allowable amount\",\"\"))","v":""}]
[null,{"$f":"IF(H189=0,\"\",\"Note that any project receiving HOME funding will require Environmental Review which can take up to 120 days to complete.\")","v":""}]
[]
[{"$f":"+L193","v":13.04},"CDBG Disaster Recovery Funds (CDBG-DR)",null,null,null,null,null,null,null,null,null,{"$f":"+L187+0.01","v":13.04},{"$f":"INDEX(Controls!A32:F36,M177,6)","v":{"$error":"#N/A"}},"HOME available in selected pool"]
[null,{"$f":"IF(ISNA(IF(M193=0,\"No CDBG-DR funds are available for award to projects in the pool you selected.\",\"Applicants in this pool may apply for up to \"&TEXT(M182,\"#,##0\")&\" per project in CDBG-DR funds.\"))=TRUE, \"\",IF(M193=0,\"No CDBG-DR funds are available for award to projects in the pool you selected.\",\"Applicants in this pool may apply for up to \"&TEXT(M182,\"#,##0\")&\" per project in CDBG-DR funds.\"))","v":""},null,null,null,null,null,null,null,null,null,null,0,"NHTF Per Project Cap"]
[null,"Amount of CDBG-DR funds requested:",null,null,null,null,null,null,null,null,null,null,{"$f":"+M194","v":0},"Per Project Cap for This Project"]
[null,{"$f":"IF(H195<0,\"CDBG negative amount not allowed\",IF(H195>M195,\"CDBG exceeds maximum allowable amount\",\"\"))","v":""}]
[null,{"$f":"IF(H195=0,\"\",\"Note that any project receiving CDBG-DR funding will require Environmental Review which can take up to 120 days to complete.\")","v":""}]
[]
[{"$f":"\"Section \"&L199","v":"Section 14"},{"$f":"IF(H9=\"YES\",\"Requests for 4% LIHTCs\",\"Requests for 9% LIHTCs\")","v":"Requests for 9% LIHTCs"},null,null,null,null,null,null,null,"QAP Reference",null,{"$f":"+L174+1","v":14}]
[null,{"$f":"IF(H23=\"Yes\",\"Complete this Section\",\"Skip to Section \"&L215)","v":"Skip to Section 15"}]
[]
[{"$f":"+L202","v":14.01},{"$f":"\"The LIHTC Per Project Cap for the \"&TRIM(H177)&\" pool is:\"","v":"The LIHTC Per Project Cap for the Missing pool is:"},null,null,null,null,null,{"$f":"IF(ISNA(INDEX(Controls!A32:C36,M177,3))=TRUE,0,INDEX(Controls!A32:C36,M177,3))","v":0},null,{"$f":"+'QAP Reference'!A12","v":"II.B"},null,{"$f":"+L199+0.01","v":14.01}]
[]
[{"$f":"+L204","v":14.02},"Credits requested",null,null,null,null,null,null,null,null,null,{"$f":"+L202+0.01","v":14.02}]
[null,{"$f":"IF(ISNA(IF(H204>H202,\"LIHTCs cannot exceed the cap for the \"&H177&\" pool\",\"\"))=TRUE,\"\",IF(H204>H202,\"LIHTCs cannot exceed the cap for the \"&H177&\" pool\",\"\"))","v":""}]
[]
[{"$f":"+L207","v":14.01},"The new construction / rehabilitation housing credit rate will be:",null,null,null,null,null,0.09,null,null,null,{"$f":"+L199+0.01","v":14.01}]
[null,"If your 9% LIHTC transaction will include acquisition (\"4%\") credits, you will need to indicate the appropriate housing credit rate (typically more than 3.0% and less than 4.0%). This is published monthly by the Internal Revenue Service."]
[{"$f":"+L209","v":14.02},"The acquisition housing credit rate is estimated to be:",null,null,null,null,null,0,null,null,null,{"$f":"+L207+0.01","v":14.02}]
[null,"Comment"]
[]
[{"$f":"+L212","v":14.03},"LIHTC Set-Aside Election",null,null,null,null,null,"Missing",null,null,null,{"$f":"+L209+0.01","v":14.03}]
[null,{"$f":"IF(H212<>\"Income Averaging\",\"\",M213)","v":""},null,null,null,null,null,null,null,null,null,null,"When you complete the Unit Mix and Rents worksheet, remember to specify LIHTC units with income restrictions at 70% AMI and/or 80% AMI. The Income Average for the project will be shown toward the bottom of the Unit Mix and Rents worksheet."]
[]
[{"$f":"\"Section \"&L215","v":"Section 15"},"Basis Boost",null,null,null,null,null,null,null,"QAP Reference",null,{"$f":"+L199+1","v":15}]
[null,{"$f":"IF(OR(H12=\"Yes\",H23=\"Yes\"),\"Complete this Section\",\"Skip to Section \"&L228)","v":"Skip to Section 16"}]
[]
[{"$f":"+L218","v":15.01},"Indicate below any Basis Boost that you are proposing:",null,null,null,null,null,"Missing",null,{"$f":"+'QAP Reference'!A19","v":"II.C"},null,{"$f":"+L215+0.01","v":15.01},{"$f":"IF(OR(H219<>0,H220<>0),\"Boost\",\"No Boost\")","v":"No Boost"}]
[null,"Boost for Construction Basis",null,null,null,null,null,0,null,null,null,null,{"$f":"IF(H23=\"Yes\",\"9% Project\",IF(H12=\"Yes\",\"4% Project\",\"No LIHTCs\"))","v":"No LIHTCs"}]
[null,"Boost for Acquisition Basis",null,null,null,null,null,0]
[null,{"$f":"IF(H220=0,\"\",\"LHC advises that Acquisition Basis is not eligible for boost. Be sure to explain (in your Checklist response) why you propose boost for Acquisition Basis.\")","v":""}]
[null,{"$f":"IF(M219<>\"9% Project\",\"\",IF(H219<30.1%,\"\",\"Error -- Proposed boost % for 9% Project must be 30% or less\"))","v":""}]
[null,{"$f":"IF(M219<>\"4% Project\",\"\",IF(H219=0%,\"\",\"Error -- Only Projets with competitive LIHTCs may qualify for a 30% basis boost\"))","v":""}]
[null,{"$f":"IF(M218=\"Boost\",\"The Checklist worksheet will include an information request regarding Basis Boost.\",\"\")","v":""}]
[]
[null,{"$f":"IF(AND(M218=\"Boost\",H92=\"No\"),M226,\"\")","v":""},null,null,null,null,null,null,null,null,null,null,"You indicated that this is a multi-site project and that you are applying for a Basis Boost. Note that 100% of the project sites must qualify for the Basis Boost."]
[]
[{"$f":"\"Section \"&L228","v":"Section 16"},"Project Schedule",null,null,null,null,null,null,null,"QAP Reference",null,{"$f":"+L215+1","v":16}]
[]
[null,"A. SITE",null,null,null,null,null,"Estimated Date"]
[{"$f":"+L231","v":16.010000000000002},null,"Option/Contract",null,null,null,null,null,null,null,null,{"$f":"+L228+0.01","v":16.010000000000002}]
[{"$f":"+L232","v":16.020000000000003},null,"Site Acquisition",null,null,null,null,null,null,null,null,{"$f":"+L231+0.01","v":16.020000000000003}]
[{"$f":"+L233","v":16.030000000000005},null,"Zoning Approval",null,null,null,null,null,null,null,null,{"$f":"+L232+0.01","v":16.030000000000005}]
[{"$f":"+L234","v":16.040000000000006},null,"Site Analysis",null,null,null,null,null,null,null,null,{"$f":"+L233+0.01","v":16.040000000000006}]
[{"$f":"+L235","v":16.050000000000008},null,"Environmental Clearance",null,null,null,null,null,null,null,null,{"$f":"+L234+0.01","v":16.050000000000008}]
[]
[null,"B. FINANCING"]
[null,"1. Construction Loan / Interim Financing"]
[{"$f":"+L239","v":16.060000000000009},null,"Loan Application",null,null,null,null,null,null,null,null,{"$f":"+L235+0.01","v":16.060000000000009}]
[{"$f":"+L240","v":16.070000000000011},null,"Conditional Commitment",null,null,null,null,null,null,null,null,{"$f":"+L239+0.01","v":16.070000000000011}]
[{"$f":"+L241","v":16.080000000000013},null,"Firm Commitment",null,null,null,null,null,null,null,null,{"$f":"+L240+0.01","v":16.080000000000013}]
[null,"2. Permanent Loan"]
[{"$f":"+L243","v":16.090000000000014},null,"Loan Application",null,null,null,null,null,null,null,null,{"$f":"+L241+0.01","v":16.090000000000014}]
[{"$f":"+L244","v":16.100000000000016},null,"Conditional Commitment",null,null,null,null,null,null,null,null,{"$f":"+L243+0.01","v":16.100000000000016}]
[{"$f":"+L245","v":16.110000000000017},null,"Firm Commitment",null,null,null,null,null,null,null,null,{"$f":"+L244+0.01","v":16.110000000000017}]
[null,"3. Other Loans and Grants #1"]
[{"$f":"+L247","v":16.120000000000019},null,"Type and Source",null,null,null,null,null,null,null,null,{"$f":"+L245+0.01","v":16.120000000000019}]
[{"$f":"+L248","v":16.13000000000002},null,"Application",null,null,null,null,null,null,null,null,{"$f":"+L247+0.01","v":16.13000000000002}]
[{"$f":"+L249","v":16.140000000000022},null,"Award",null,null,null,null,null,null,null,null,{"$f":"+L248+0.01","v":16.140000000000022}]
[null,"4. Other Loans and Grants #2"]
[{"$f":"+L251","v":16.150000000000023},null,"Type and Source",null,null,null,null,null,null,null,null,{"$f":"+L249+0.01","v":16.150000000000023}]
[{"$f":"+L252","v":16.160000000000025},null,"Application",null,null,null,null,null,null,null,null,{"$f":"+L251+0.01","v":16.160000000000025}]
[{"$f":"+L253","v":16.170000000000027},null,"Award",null,null,null,null,null,null,null,null,{"$f":"+L252+0.01","v":16.170000000000027}]
[null,"5. Other Loans and Grants #3"]
[{"$f":"+L255","v":16.180000000000028},null,"Type and Source",null,null,null,null,null,null,null,null,{"$f":"+L253+0.01","v":16.180000000000028}]
[{"$f":"+L256","v":16.19000000000003},null,"Application",null,null,null,null,null,null,null,null,{"$f":"+L255+0.01","v":16.19000000000003}]
[{"$f":"+L257","v":16.200000000000031},null,"Award",null,null,null,null,null,null,null,null,{"$f":"+L256+0.01","v":16.200000000000031}]
[]
[{"$f":"+L259","v":16.210000000000033},"C. PLANS AND SPECS, WORKING DRAWINGS",null,null,null,null,null,null,null,null,null,{"$f":"+L257+0.01","v":16.210000000000033}]
[]
[{"$f":"+L261","v":16.220000000000034},"D. INITIAL CLOSING AND TRANSFER OF PROPERTY",null,null,null,null,null,null,null,null,null,{"$f":"+L259+0.01","v":16.220000000000034}]
[]
[{"$f":"+L263","v":16.230000000000036},"E.  CONSTRUCTION START",null,null,null,null,null,null,null,null,null,{"$f":"+L261+0.01","v":16.230000000000036}]
[{"$f":"+L264","v":16.240000000000038},null,"10% Construction Complete",null,null,null,null,null,null,null,null,{"$f":"+L263+0.01","v":16.240000000000038}]
[{"$f":"+L265","v":16.250000000000039},null,"50% Construction Complete",null,null,null,null,null,null,null,null,{"$f":"+L264+0.01","v":16.250000000000039}]
[{"$f":"+L266","v":16.260000000000041},null,"90% Construction Complete",null,null,null,null,null,null,null,null,{"$f":"+L265+0.01","v":16.260000000000041}]
[]
[{"$f":"+L268","v":16.270000000000042},"F. COMPLETION DATE",null,null,null,null,null,null,null,null,null,{"$f":"+L266+0.01","v":16.270000000000042}]
[]
[{"$f":"+L270","v":16.280000000000044},"G. CERTIFICATE OF OCCUPANCY",null,null,null,null,null,null,null,null,null,{"$f":"+L268+0.01","v":16.280000000000044}]
[]
[{"$f":"+L272","v":16.290000000000045},"H. PLACED IN SERVICE DATE (FIRST BUILDING)",null,null,null,null,null,null,null,null,null,{"$f":"+L270+0.01","v":16.290000000000045}]
[]
[{"$f":"+L274","v":16.300000000000047},"I. PLACED IN SERVICE DATE (FINAL BUILDING)",null,null,null,null,null,null,null,null,null,{"$f":"+L272+0.01","v":16.300000000000047}]
[]
[{"$f":"+L276","v":16.310000000000048},"J. 10% OF UNIT OCCUPANCY ACHIEVED",null,null,null,null,null,null,null,null,null,{"$f":"+L274+0.01","v":16.310000000000048}]
[]
[{"$f":"+L278","v":16.32000000000005},"K. FINAL CLOSING (ALL PERMANENT FINANCING)",null,null,null,null,null,null,null,null,null,{"$f":"+L276+0.01","v":16.32000000000005}]
[]
[null,"Applicant comment regarding Project Schedule:"]
[{"$f":"+L281","v":16.330000000000052},"Comment",null,null,null,null,null,null,null,null,null,{"$f":"+L278+0.01","v":16.330000000000052}]
[]
[{"$f":"\"Section \"&L283","v":"Section 17"},"Construction Period Sources of Funds",null,null,null,null,null,null,null,"QAP Reference",null,{"$f":"+L228+1","v":17}]
[]
[{"$f":"+L285","v":17.010000000000002},"Please explain: (1) When each permanent source of funding is expected to be received; (2) How you plan to meet construction period development costs, prior to the time that all permanent sources of funds have been received; (3) How you estimated construction period interest expense; and (4) Each construction period source of funding including at least: who is providing the funds, whether the funds provider is third party or IOI, the amount of each source of funds, whether any source of funds involves tax-exempt bond financing (whether by LHC or by another issuer), and the key business terms on which funding will be provided.  The explanation can be provided below, or in an attachment, whichever approach the applicant prefers.",null,null,null,null,null,null,null,null,null,{"$f":"+L283+0.01","v":17.010000000000002}]
[null,"Comment"]
[]
[{"$f":"\"Section \"&L288","v":"Section 18"},"Permanent Sources of Funds",null,null,null,null,null,null,null,"QAP Reference",null,{"$f":"+L283+1","v":18}]
[]
[null,{"$f":"\"Any sources of funds with 'must-pay' debt service should be entered in \"&L293&\", \"&L309&\", or \"&L334&\".\"","v":"Any sources of funds with 'must-pay' debt service should be entered in 18.01, 18.02, or 18.03."}]
[null,{"$f":"\"Soft debt / equity / grants should be entered in the remaining portions of Section \"&L288&\".\"","v":"Soft debt / equity / grants should be entered in the remaining portions of Section 18."}]
[]
[{"$f":"+L293","v":18.010000000000002},"New LHC Risk Sharing First Mortgage Loan",null,null,null,null,null,null,null,null,null,{"$f":"+L288+0.01","v":18.010000000000002}]
[null,"Description:",null,null,"New LHC Risk Sharing First Mortgage Loan"]
[null,"Loan Amount:",null,null,0]
[null,"Lender:",null,null,"Louisiana Housing Corporation"]
[null,"Lender is:",null,null,"Third Party"]
[null,"Interest Rate:",null,null,0,"per year",null,null,null,null,null,null,{"$f":"+E295*E298","v":0},"annual interest"]
[null,"Fixed or Floating Rate?",null,null,"Missing",null,{"$f":"\"     \"&IF(E299=Controls!A68,\"Provide explanation below\",\"\")","v":"     "}]
[null,"Amortization Term:",null,null,0,"months",{"$f":"+E300/12","v":0},"years",null,null,null,null,{"$f":"IF(E300=0,0,-PMT(E298/12,E300,E295)*12)","v":0},"annual P+I"]
[null,"Maturity Term:",null,null,0,"months",{"$f":"+E301/12","v":0},"years"]
[null,"Mtg. Ins. Premium:",null,null,0,"per year",null,null,null,null,null,null,{"$f":"+E295*E302","v":0},"first year MIP"]
[null,"Type of Payment:",null,null,"Missing",null,null,null,null,null,null,null,{"$f":"MATCH(E303,Controls!A71:A74,0)","v":4}]
[null,"Annual Payment:",null,null,{"$f":"+M304","v":0},null,{"$f":"IF(E295=0,\"\",\"     \"&\"LHC calculates \"&TEXT(M304,\"#,##0.00\")&\" (\"&N304&\")\")","v":""},null,null,null,null,null,{"$f":"CHOOSE(M303,M298,M300,M300+M302,0)","v":0},{"$f":"CHOOSE(M303,\"IO\",\"P+I\",\"P+I+MIP\",\"\")","v":""}]
[null,"Payment Requirement:",null,null,"Missing",null,{"$f":"\"     \"&IF(E305=Controls!$A$76,\"\",IF(E305=Controls!$A$75,\"\",\"Provide explanation below\"))","v":"     "}]
[null,{"$f":"\"Applicant comments regarding \"&E294&\":\"","v":"Applicant comments regarding New LHC Risk Sharing First Mortgage Loan:"}]
[null,"Comment"]
[]
[{"$f":"+L309","v":18.020000000000003},"Existing or New First Mortgage Loan",null,null,null,null,null,null,null,null,null,{"$f":"+L293+0.01","v":18.020000000000003}]
[null,"Description:"]
[null,"Original Loan Amount:",null,null,null,null,"At time loan is/was originated"]
[null,"Origination Date:",null,null,null,null,"(If loan is existing)",null,null,null,null,null,{"$f":"+E322-G323*365.25","v":"00:00:00"},"Calculated origination date"]
[null,"Est'd Balance:",null,null,null,null,{"$f":"\"As of \"&TEXT(H261,\"mmm-d-yyyy\")&\" initial closing\"","v":"As of Jan-0-1900 initial closing"},null,null,null,null,null,{"$f":"+H261","v":"00:00:00"},"Initial closing"]
[null,"Lender:"]
[null,"Loan Type:"]
[null,"Loan Servicer:"]
[null,"Prepayment Penalty?"]
[null,"Lock Out Date?"]
[null,"Lender is:",null,null,"Missing"]
[null,"Interest Rate:",null,null,null,"per year",null,null,null,null,null,null,{"$f":"+E313*E320","v":0},"annual interest"]
[null,"Fixed or Floating Rate?",null,null,"Missing",null,{"$f":"\"     \"&IF(E321=Controls!A68,\"Provide explanation below\",\"\")","v":"     "}]
[null,"Amortization End Date:",null,null,null,null,{"$f":"IF(E312=0,G323,M322)","v":0},"years from origination",null,null,null,null,{"$f":"+(E322-E312)/365.25","v":0},"years (from user's origination date)"]
[null,"Amortization Term:",null,null,null,"months",{"$f":"+E323/12","v":0},"years from origination",null,null,null,null,{"$f":"IF(OR(E311=0,E323=0),0,-PMT(E320/12,E323,E311)*12)","v":0},"annual P+I"]
[null,"Remaining:",null,null,{"$f":"IFERROR(+G324*12,\"\")","v":0},"months",{"$f":"IF(M324<G323,ROUND(M324,1),G323)","v":0},"years from initial closing",null,null,null,null,{"$f":"+(E322-M313)/365.25","v":0}]
[null,"Maturity Date:",null,null,null,null,{"$f":"ROUND(M325,1)","v":0},"years from origination",null,null,null,null,{"$f":"+(E325-E312)/365.25","v":0},"years",{"$f":"+(E322-E325)/365.25","v":0},"years before amortization end date"]
[null,"Remaining:",null,null,{"$f":"IFERROR(+E324-O325*12,\"\")","v":0},"months",{"$f":"+E326/12","v":0},"years from initial closing",null,null,null,null,{"$f":"+(E325-M313)/365.25","v":0}]
[null,"Mtg. Ins. Premium:",null,null,0,"per year",null,null,null,null,null,null,{"$f":"+E313*E327","v":0},"first year MIP"]
[null,"Type of Payment:",null,null,"Missing",null,null,null,null,null,null,null,{"$f":"MATCH(E328,Controls!A71:A74,0)","v":4}]
[null,"Annual Payment:",null,null,{"$f":"+M329","v":0},null,{"$f":"IF(E311=0,\"\",\"     \"&\"LHC calculates \"&TEXT(M329,\"#,##0.00\")&\" (\"&N329&\")\")","v":""},null,null,null,null,null,{"$f":"CHOOSE(M328,M320,M323,M323+M327,0)","v":0},{"$f":"CHOOSE(M328,\"IO\",\"P+I\",\"P+I+MIP\",\"\")","v":""}]
[null,"Payment Requirement:",null,null,"Must Pay",null,{"$f":"\"     \"&IF(E330=Controls!$A$76,\"\",IF(E330=Controls!$A$75,\"\",\"Provide explanation below\"))","v":"     "}]
[null,{"$f":"\"Applicant comments regarding \"&E310&\":\"","v":"Applicant comments regarding :"}]
[null,"Comment"]
[]
[{"$f":"+L334","v":18.030000000000005},"Existing or New Second Mortgage Loan",null,null,null,null,null,null,null,null,null,{"$f":"+L309+0.01","v":18.030000000000005}]
[null,"Description:",null,null,"Non-LHC loan #2 (identify lender):"]
[null,"Original Loan Amount:",null,null,0,null,"At time loan is/was originated"]
[null,"Origination Date:",null,null,"00:00:00"]
[null,"Est'd Balance:",null,null,0,null,{"$f":"\"As of \"&TEXT(H261,\"mmm-d-yyyy\")&\" initial closing\"","v":"As of Jan-0-1900 initial closing"},null,null,null,null,null,{"$f":"+H261","v":"00:00:00"},"Initial closing"]
[null,"Lender:",null,null,"Missing"]
[null,"Loan Type:",null,null,"Missing"]
[null,"Loan Servicer:",null,null,"Missing"]
[null,"Prepayment Penalty?",null,null,"Missing"]
[null,"Lock Out Date?",null,null,"Missing"]
[null,"Lender is:",null,null,"Missing"]
[null,"Interest Rate:",null,null,0,"per year",null,null,null,null,null,null,{"$f":"+E338*E345","v":0},"annual interest"]
[null,"Fixed or Floating Rate?",null,null,"Missing",null,{"$f":"\"     \"&IF(E346=Controls!A68,\"Provide explanation below\",\"\")","v":"     "}]
[null,"Amortization End Date:",null,null,"00:00:00",null,{"$f":"IF(E337=0,G348,M347)","v":0},"years from origination",null,null,null,null,{"$f":"+(E347-E337)/365.25","v":0},"years"]
[null,"Amortization Term:",null,null,0,"months",{"$f":"+E348/12","v":0},"years from origination",null,null,null,null,{"$f":"IF(OR(E336=0,E348=0),0,-PMT(E345/12,E348,E336)*12)","v":0},"annual P+I"]
[null,"Remaining:",null,null,{"$f":"+G349*12","v":0},"months",{"$f":"IF(M349<G348,ROUND(M349,1),G348)","v":0},"years from initial closing",null,null,null,null,{"$f":"+(E347-M338)/365.25","v":0}]
[null,"Maturity Date:",null,null,"00:00:00",null,{"$f":"ROUND(M350,1)","v":0},"years from origination",null,null,null,null,{"$f":"+(E350-E337)/365.25","v":0},"years",{"$f":"+(E347-E350)/365.25","v":0},"years before amortization end date"]
[null,"Remaining:",null,null,{"$f":"+E349-O350*12","v":0},"months",{"$f":"+E351/12","v":0},"years from initial closing",null,null,null,null,{"$f":"+(E350-M338)/365.25","v":0}]
[null,"Mtg. Ins. Premium:",null,null,0,"per year",null,null,null,null,null,null,{"$f":"+E338*E352","v":0},"first year MIP"]
[null,"Type of Payment:",null,null,"Missing",null,null,null,null,null,null,null,{"$f":"MATCH(E353,Controls!A71:A74,0)","v":4}]
[null,"Annual Payment:",null,null,{"$f":"+M354","v":0},null,{"$f":"IF(E338=0,\"\",\"     \"&\"LHC calculates \"&TEXT(M354,\"#,##0.00\")&\" (\"&N354&\")\")","v":""},null,null,null,null,null,{"$f":"CHOOSE(M353,M345,M348,M348+M352,0)","v":0},{"$f":"CHOOSE(M353,\"IO\",\"P+I\",\"P+I+MIP\",\"\")","v":""}]
[null,"Payment Requirement:",null,null,"Must Pay",null,{"$f":"\"     \"&IF(E355=Controls!$A$76,\"\",IF(E355=Controls!$A$75,\"\",\"Provide explanation below\"))","v":"     "}]
[null,{"$f":"\"Applicant comments regarding \"&E335&\":\"","v":"Applicant comments regarding Non-LHC loan #2 (identify lender)::"}]
[null,"Comment"]
[]
[{"$f":"+L359","v":18.040000000000006},"HOME Loan from LHC",null,null,null,null,null,null,null,null,null,{"$f":"+L334+0.01","v":18.040000000000006}]
[null,"Loan Type:",null,null,"Missing"]
[null,"Description:",null,null,"LHC HOME Loan",null,null,null,null,null,null,null,{"$f":"\"LHC HOME Loan (\"&E360&\")\"","v":"LHC HOME Loan (Missing)"}]
[null,"Loan Amount:",null,null,{"$f":"+H189","v":0}]
[null,"Lender:",null,null,"Louisiana Housing Corporation"]
[null,"Lender is:",null,null,"Third Party"]
[null,"Interest Rate:",null,null,0,"per year",null,null,null,null,null,null,{"$f":"+E362*E365","v":0},"annual interest"]
[null,"Fixed or Floating Rate?",null,null,"Missing",null,{"$f":"\"     \"&IF(E366=Controls!A68,\"Provide explanation below\",\"\")","v":"     "}]
[null,"Amortization Term:",null,null,0,"months",{"$f":"+E367/12","v":0},"years",null,null,null,null,{"$f":"IF(OR(E362=0,E367=0),0,-PMT(E365/12,E367,E362)*12)","v":0},"annual P+I"]
[null,"Maturity Term:",null,null,0,"months",{"$f":"+E368/12","v":0},"years"]
[null,"Mtg. Ins. Premium:",null,null,0,"per year",null,null,null,null,null,null,{"$f":"+E362*E369","v":0},"first year MIP"]
[null,"Type of Payment:",null,null,"Missing",null,null,null,null,null,null,null,{"$f":"MATCH(E370,Controls!A71:A74,0)","v":4}]
[null,"Annual Payment:",null,null,{"$f":"+M371","v":0},null,{"$f":"IF(E362=0,\"\",\"     \"&\"LHC calculates \"&TEXT(M371,\"#,##0.00\")&\" (\"&N371&\")\")","v":""},null,null,null,null,null,{"$f":"CHOOSE(M370,M365,M367,M367+M369,0)","v":0},{"$f":"CHOOSE(M370,\"IO\",\"P+I\",\"P+I+MIP\",\"\")","v":""}]
[null,"Payment Requirement:",null,null,"Must Pay",null,{"$f":"\"     \"&IF(E372=Controls!$A$76,\"\",IF(E372=Controls!$A$75,\"\",\"Provide explanation below\"))","v":"     "}]
[null,{"$f":"\"Applicant comments regarding \"&E361&\":\"","v":"Applicant comments regarding LHC HOME Loan:"}]
[null,"Comment"]
[]
[{"$f":"+L376","v":18.050000000000008},"NHTF Loan from LHC",null,null,null,null,null,null,null,null,null,{"$f":"+L359+0.01","v":18.050000000000008}]
[null,"Loan Type:",null,null,"Missing"]
[null,"Description:",null,null,"LHC NHTF Loan",null,null,null,null,null,null,null,{"$f":"\"LHC NHTF Loan (\"&E377&\")\"","v":"LHC NHTF Loan (Missing)"}]
[null,"Loan Amount:",null,null,{"$f":"+H183","v":0}]
[null,"Lender:",null,null,"Louisiana Housing Corporation"]
[null,"Lender is:",null,null,"Third Party"]
[null,"Interest Rate:",null,null,0,"per year",null,null,null,null,null,null,{"$f":"+E379*E382","v":0},"annual interest"]
[null,"Fixed or Floating Rate?",null,null,"Missing",null,{"$f":"\"     \"&IF(E383=Controls!A68,\"Provide explanation below\",\"\")","v":"     "}]
[null,"Amortization Term:",null,null,0,"months",{"$f":"+E384/12","v":0},"years",null,null,null,null,{"$f":"IF(OR(E379=0,E384=0),0,-PMT(E382/12,E384,E379)*12)","v":0},"annual P+I"]
[null,"Maturity Term:",null,null,0,"months",{"$f":"+E385/12","v":0},"years"]
[null,"Mtg. Ins. Premium:",null,null,0,"per year",null,null,null,null,null,null,{"$f":"+E379*E386","v":0},"first year MIP"]
[null,"Type of Payment:",null,null,"Missing",null,null,null,null,null,null,null,{"$f":"MATCH(E387,Controls!A71:A74,0)","v":4}]
[null,"Annual Payment:",null,null,{"$f":"+M388","v":0},null,{"$f":"IF(E379=0,\"\",\"     \"&\"LHC calculates \"&TEXT(M388,\"#,##0.00\")&\" (\"&N388&\")\")","v":""},null,null,null,null,null,{"$f":"CHOOSE(M387,M382,M384,M384+M386,0)","v":0},{"$f":"CHOOSE(M387,\"IO\",\"P+I\",\"P+I+MIP\",\"\")","v":""}]
[null,"Payment Requirement:",null,null,"Must Pay",null,{"$f":"\"     \"&IF(E389=Controls!$A$76,\"\",IF(E389=Controls!$A$75,\"\",\"Provide explanation below\"))","v":"     "}]
[null,{"$f":"\"Applicant comments regarding \"&E378&\":\"","v":"Applicant comments regarding LHC NHTF Loan:"}]
[null,"Comment"]
[]
[{"$f":"+L393","v":18.060000000000009},"CDBG-DR Loan from LHC or OCD",null,null,null,null,null,null,null,null,null,{"$f":"+L376+0.01","v":18.060000000000009}]
[null,"Loan Type:",null,null,"Gap Financing Loan with annual payments from Surplus Cash"]
[null,"Description:",null,null,"CDBG-DR Gap Financing Loan"]
[null,"Loan Amount:",null,null,{"$f":"+H195","v":0}]
[null,"Lender:",null,null,"LA Office of Community Development"]
[null,"Lender is:",null,null,"Third Party"]
[null,"Interest Rate:",null,null,0,"      per year",{"$f":"IF(E399=0,\"\",\"The Checklist worksheet will include a question\")","v":""}]
[null,"Fixed or Floating Rate?",null,null,"Fixed Rate"]
[null,"Amortization Term:",null,null,0,"months",{"$f":"+E401/12","v":0},"years"]
[null,"Maturity Term:",null,null,0,"months",{"$f":"+E402/12","v":0},"years"]
[null,"Mtg. Ins. Premium:",null,null,"Not applicable"]
[null,"Type of Payment:",null,null,"Annual payment from Surplus Cash"]
[null,"Annual Payment:",null,null,"Depends on actual annual Surplus Cash"]
[null,"Payment Requirement:",null,null,"No payment required if Surplus Cash is negative"]
[null,{"$f":"\"Applicant comments regarding \"&E395&\":\"","v":"Applicant comments regarding CDBG-DR Gap Financing Loan:"}]
[null,"Comment"]
[]
[{"$f":"+L410","v":18.070000000000011},"Deferred Developer Fee",null,null,null,null,null,null,null,null,null,{"$f":"+L393+0.01","v":18.070000000000011}]
[null,"Description:",null,null,{"$f":"+B410","v":"Deferred Developer Fee"},null,null,null,null,null,null,null,{"$f":"+Proforma!C51","v":0},"Cumulative Surplus Cash through year 15"]
[null,"Amount:",null,null,null,null,null,null,null,null,null,null,0.5,"Maximum allowable for deferred developer fee"]
[null,{"$f":"IF(E412=0,\"\",\"The Checklist will include an information request.\")","v":""},null,null,null,null,null,null,null,null,null,null,{"$f":"+M411*M412","v":0},"Maximum allowable deferred developer fee"]
[null,"Comment",null,null,null,null,null,null,null,null,null,null,{"$f":"\"You proposed \"&TEXT(E412,\"#,##0\")&\" of Deferred Developer Fee (DDF), which exceeds 50% of Surplus Cash from the Proforma page (\"&TEXT(M413,\"#,##0\")&\").  Please reduce the DDF amount so it falls within this limitation.  Note that you will need to reduce the DDF further, if you plan on charging interest, or if DDF is not first in your transaction's cash flow waterfall.\"","v":"You proposed 0 of Deferred Developer Fee (DDF), which exceeds 50% of Surplus Cash from the Proforma page (0).  Please reduce the DDF amount so it falls within this limitation.  Note that you will need to reduce the DDF further, if you plan on charging interest, or if DDF is not first in your transaction's cash flow waterfall."}]
[null,{"$f":"IF(E412=0,\"\",IF(E412>M413,M414,M415))","v":""},null,null,null,null,null,null,null,null,null,null,{"$f":"\"You proposed \"&TEXT(E412,\"#,##0\")&\" of Deferred Developer Fee (DDF), which falls within 50% of Surplus Cash from the Proforma page (\"&TEXT(M413,\"#,##0\")&\").  Please note that you may need to reduce the DDF, if you plan on charging interest, or if DDF is not first in your transaction's cash flow waterfall.\"","v":"You proposed 0 of Deferred Developer Fee (DDF), which falls within 50% of Surplus Cash from the Proforma page (0).  Please note that you may need to reduce the DDF, if you plan on charging interest, or if DDF is not first in your transaction's cash flow waterfall."}]
[{"$f":"+L416","v":18.080000000000013},"Federal Historic Tax Credits and Equity",null,null,null,null,null,null,null,null,null,{"$f":"+L410+0.01","v":18.080000000000013}]
[null,"Description:",null,null,{"$f":"+B416","v":"Federal Historic Tax Credits and Equity"}]
[null,"Amount of Equity:",null,null,0]
[null,"Amount of Credits:",null,null,0]
[]
[null,"Comment"]
[]
[{"$f":"+L423","v":18.090000000000014},"State Historic Tax Credits and Equity",null,null,null,null,null,null,null,null,null,{"$f":"+L416+0.01","v":18.090000000000014}]
[null,"Description:",null,null,{"$f":"+B423","v":"State Historic Tax Credits and Equity"}]
[null,"Amount of Equity:",null,null,0]
[null,"Amount of Credits:",null,null,0]
[null,{"$f":"IF(OR(E425>0,E426>0),\"Explain who will receive the credits, and how the proceeds of the credit sale will be provided to the applicant / taxpayer.\",\"\")","v":""}]
[null,"Comment"]
[]
[{"$f":"+L430","v":18.100000000000016},"Estimated LIHTC Equity Proceeds",null,null,null,null,null,null,null,null,null,{"$f":"+L423+0.01","v":18.100000000000016}]
[null,"Description:",null,null,{"$f":"+B430","v":"Estimated LIHTC Equity Proceeds"}]
[null,"Amount:",null,null,0,null,null,null,null,null,null,null,{"$f":"+Syndication!J28","v":0},"Syndication Cert F (Gross Equity Invested in Taxpayer)"]
[null,{"$f":"\"     \"&IF(ROUND(E432,0)=ROUND(M432,0),\"\",\"Error; must match \"&TEXT(M432,\"#,##0\")&\" Net Equity from Syndication Certification\")","v":"     "}]
[]
[{"$f":"+L435","v":18.110000000000017},"Donated Amount #1",null,null,null,null,null,null,null,null,null,{"$f":"+L430+0.01","v":18.110000000000017}]
[null,"Donation Type:",null,null,"Donated / Volunteer Labor"]
[null,"Description:",null,null,"Donated / Volunteer Labor"]
[null,"Amount:",null,null,0]
[]
[null,"Comment"]
[]
[{"$f":"+L442","v":18.120000000000019},"Donated Amount #2",null,null,null,null,null,null,null,null,null,{"$f":"+L435+0.01","v":18.120000000000019}]
[null,"Donation Type:",null,null,"Donated / Volunteer Labor"]
[null,"Description:",null,null,"Donated Materials"]
[null,"Amount:",null,null,0]
[]
[null,"Comment"]
[]
[{"$f":"+L449","v":18.13000000000002},"Donated Amount #3",null,null,null,null,null,null,null,null,null,{"$f":"+L442+0.01","v":18.13000000000002}]
[null,"Donation Type:",null,null,"Donated / Volunteer Labor"]
[null,"Description:",null,null,"Donated Land Value"]
[null,"Amount:",null,null,0]
[]
[null,"Comment"]
[]
[{"$f":"+L456","v":18.140000000000022},"Other Permanent Source #1",null,null,null,null,null,null,null,null,null,{"$f":"+L449+0.01","v":18.140000000000022}]
[null,"Description:",null,null,"Other Permanent Debt"]
[null,"Type of Funding:",null,null,"Permanent Soft Debt"]
[null,"Federal Grant?:",null,null,"No"]
[null,"Funding Amount:",null,null,0]
[null,"Lender:",null,null,"Missing"]
[null,"Lender is:",null,null,"Missing"]
[null,"Interest Rate:",null,null,0,"per year",null,null,null,null,null,null,{"$f":"+E460*E463","v":0},"annual interest"]
[null,"Fixed or Floating Rate?",null,null,"Missing",null,{"$f":"\"     \"&IF(E464=Controls!A68,\"Provide explanation below\",\"\")","v":"     "}]
[null,"Amortization Term:",null,null,0,"months",{"$f":"+E465/12","v":0},"years",null,null,null,null,{"$f":"IF(OR(E460=0,E465=0,),0,-PMT(E463/12,E465,E460)*12)","v":0},"annual P+I"]
[null,"Maturity Term:",null,null,0,"months",{"$f":"+E466/12","v":0},"years"]
[null,"Mtg. Ins. Premium:",null,null,0,"per year",null,null,null,null,null,null,{"$f":"+E460*E467","v":0},"first year MIP"]
[null,"Type of Payment:",null,null,"Missing",null,null,null,null,null,null,null,{"$f":"MATCH(E468,Controls!A71:A74,0)","v":4}]
[null,"Annual Payment:",null,null,{"$f":"+M469","v":0},null,{"$f":"IF(E460=0,\"\",\"     \"&\"LHC calculates \"&TEXT(M469,\"#,##0.00\")&\" (\"&N469&\")\")","v":""},null,null,null,null,null,{"$f":"CHOOSE(M468,M463,M465,M465+M467,0)","v":0},{"$f":"CHOOSE(M468,\"IO\",\"P+I\",\"P+I+MIP\",\"\")","v":""}]
[null,"Payment Requirement:",null,null,"Must Pay",null,{"$f":"\"     \"&IF(E470=Controls!$A$76,\"\",IF(E470=Controls!$A$75,\"\",\"Provide explanation below\"))","v":"     "}]
[null,{"$f":"\"Applicant comments regarding \"&E457&\":\"","v":"Applicant comments regarding Other Permanent Debt:"}]
[null,"Comment"]
[]
[{"$f":"+L474","v":18.150000000000023},"Other Permanent Source #2",null,null,null,null,null,null,null,null,null,{"$f":"+L456+0.01","v":18.150000000000023}]
[null,"Description:",null,null,"#2 (Explain)"]
[null,"Type of Funding:",null,null,"Permanent Soft Debt"]
[null,"Federal Grant?:",null,null,"Missing"]
[null,"Funding Amount:",null,null,0]
[null,"Lender:",null,null,"Missing"]
[null,"Lender is:",null,null,"Missing"]
[null,"Interest Rate:",null,null,0,"per year",null,null,null,null,null,null,{"$f":"+E478*E481","v":0},"annual interest"]
[null,"Fixed or Floating Rate?",null,null,"Missing",null,{"$f":"\"     \"&IF(E482=Controls!A68,\"Provide explanation below\",\"\")","v":"     "}]
[null,"Amortization Term:",null,null,0,"months",{"$f":"+E483/12","v":0},"years",null,null,null,null,{"$f":"IF(OR(E478=0,E483=0,),0,-PMT(E481/12,E483,E478)*12)","v":0},"annual P+I"]
[null,"Maturity Term:",null,null,0,"months",{"$f":"+E484/12","v":0},"years"]
[null,"Mtg. Ins. Premium:",null,null,0,"per year",null,null,null,null,null,null,{"$f":"+E478*E485","v":0},"first year MIP"]
[null,"Type of Payment:",null,null,"Missing",null,null,null,null,null,null,null,{"$f":"MATCH(E486,Controls!A71:A74,0)","v":4}]
[null,"Annual Payment:",null,null,{"$f":"+M487","v":0},null,{"$f":"IF(E478=0,\"\",\"     \"&\"LHC calculates \"&TEXT(M487,\"#,##0.00\")&\" (\"&N487&\")\")","v":""},null,null,null,null,null,{"$f":"CHOOSE(M486,M481,M483,M483+M485,0)","v":0},{"$f":"CHOOSE(M486,\"IO\",\"P+I\",\"P+I+MIP\",\"\")","v":""}]
[null,"Payment Requirement:",null,null,"Must Pay",null,{"$f":"\"     \"&IF(E488=Controls!$A$76,\"\",IF(E488=Controls!$A$75,\"\",\"Provide explanation below\"))","v":"     "}]
[null,{"$f":"\"Applicant comments regarding \"&E475&\":\"","v":"Applicant comments regarding #2 (Explain):"}]
[null,"Comment"]
[]
[{"$f":"+L492","v":18.160000000000025},"Other Permanent Source #3",null,null,null,null,null,null,null,null,null,{"$f":"+L474+0.01","v":18.160000000000025}]
[null,"Description:",null,null,"#3 (Explain)"]
[null,"Type of Funding:",null,null,"Permanent Soft Debt"]
[null,"Federal Grant?:",null,null,"Missing"]
[null,"Funding Amount:",null,null,0]
[null,"Lender:",null,null,"Missing"]
[null,"Lender is:",null,null,"Missing"]
[null,"Interest Rate:",null,null,0,"per year",null,null,null,null,null,null,{"$f":"+E496*E499","v":0},"annual interest"]
[null,"Fixed or Floating Rate?",null,null,"Missing",null,{"$f":"\"     \"&IF(E500=Controls!A68,\"Provide explanation below\",\"\")","v":"     "}]
[null,"Amortization Term:",null,null,0,"months",{"$f":"+E501/12","v":0},"years",null,null,null,null,{"$f":"IF(OR(E496=0,E501=0,),0,-PMT(E499/12,E501,E496)*12)","v":0},"annual P+I"]
[null,"Maturity Term:",null,null,0,"months",{"$f":"+E502/12","v":0},"years"]
[null,"Mtg. Ins. Premium:",null,null,0,"per year",null,null,null,null,null,null,{"$f":"+E496*E503","v":0},"first year MIP"]
[null,"Type of Payment:",null,null,"Missing",null,null,null,null,null,null,null,{"$f":"MATCH(E504,Controls!A71:A74,0)","v":4}]
[null,"Annual Payment:",null,null,{"$f":"+M505","v":0},null,{"$f":"IF(E496=0,\"\",\"     \"&\"LHC calculates \"&TEXT(M505,\"#,##0.00\")&\" (\"&N505&\")\")","v":""},null,null,null,null,null,{"$f":"CHOOSE(M504,M499,M501,M501+M503,0)","v":0},{"$f":"CHOOSE(M504,\"IO\",\"P+I\",\"P+I+MIP\",\"\")","v":""}]
[null,"Payment Requirement:",null,null,"Must Pay",null,{"$f":"\"     \"&IF(E506=Controls!$A$76,\"\",IF(E506=Controls!$A$75,\"\",\"Provide explanation below\"))","v":"     "}]
[null,{"$f":"\"Applicant comments regarding \"&E493&\":\"","v":"Applicant comments regarding #3 (Explain):"}]
[null,"Comment"]
[]
[{"$f":"\"Section \"&L510","v":"Section 19"},"Permanent Sources of Funds (Summary)",null,null,null,null,null,null,null,"QAP Reference",null,{"$f":"+L288+1","v":19}]
[]
[null,{"$f":"+E294","v":"New LHC Risk Sharing First Mortgage Loan"},null,null,null,null,null,{"$f":"+E295","v":0},null,null,null,null,{"$f":"+E304","v":0},{"$f":"+E305","v":"Missing"}]
[null,{"$f":"IF(E310=0,\"Other Loan With Must-Pay Debt Service\",E310)","v":"Other Loan With Must-Pay Debt Service"},null,null,null,null,null,{"$f":"+E311","v":0},null,null,null,null,{"$f":"+E329","v":0},{"$f":"+E330","v":"Must Pay"}]
[null,{"$f":"IF(E335=0,\"Other Loan With Must-Pay Debt Service\",E335)","v":"Non-LHC loan #2 (identify lender):"},null,null,null,null,null,{"$f":"+E336","v":0},null,null,null,null,{"$f":"+E354","v":0},{"$f":"+E355","v":"Must Pay"}]
[null,{"$f":"+E361","v":"LHC HOME Loan"},null,null,null,null,null,{"$f":"+E362","v":0},null,null,null,null,{"$f":"+E371","v":0},{"$f":"+E372","v":"Must Pay"}]
[null,{"$f":"+E378","v":"LHC NHTF Loan"},null,null,null,null,null,{"$f":"+E379","v":0},null,null,null,null,{"$f":"+E388","v":0},{"$f":"+E389","v":"Must Pay"}]
[null,{"$f":"+E395","v":"CDBG-DR Gap Financing Loan"},null,null,null,null,null,{"$f":"+E396","v":0}]
[null,{"$f":"+E411","v":"Deferred Developer Fee"},null,null,null,null,null,{"$f":"+E412","v":0}]
[null,{"$f":"+E417","v":"Federal Historic Tax Credits and Equity"},null,null,null,null,null,{"$f":"+E418","v":0},"*"]
[null,{"$f":"+E424","v":"State Historic Tax Credits and Equity"},null,null,null,null,null,{"$f":"+E425","v":0}]
[null,{"$f":"+E431","v":"Estimated LIHTC Equity Proceeds"},null,null,null,null,null,{"$f":"+E432","v":0}]
[null,{"$f":"+E437","v":"Donated / Volunteer Labor"},null,null,null,null,null,{"$f":"+E438","v":0}]
[null,{"$f":"+E444","v":"Donated Materials"},null,null,null,null,null,{"$f":"+E445","v":0}]
[null,{"$f":"+E451","v":"Donated Land Value"},null,null,null,null,null,{"$f":"+E452","v":0}]
[null,{"$f":"IF(E457=0,\"Other Source of Funds\",E457)","v":"Other Permanent Debt"},null,null,null,null,null,{"$f":"+E460","v":0},{"$f":"IF(E459=\"Yes\",\"*\",\"\")","v":""}]
[null,{"$f":"IF(E475=0,\"Other Source of Funds\",E475)","v":"#2 (Explain)"},null,null,null,null,null,{"$f":"+E478","v":0},{"$f":"IF(E477=\"Yes\",\"*\",\"\")","v":""}]
[null,{"$f":"IF(E493=0,\"Other Source of Funds\",E493)","v":"#3 (Explain)"},null,null,null,null,null,{"$f":"+E496","v":0},{"$f":"IF(E495=\"Yes\",\"*\",\"\")","v":""}]
[]
[null,"Total Permanent Sources",null,null,null,null,null,{"$f":"SUM(H511:H528)","v":0},null,null,null,null,{"$f":"SUMIF(N511:N528,N529,M511:M528)","v":0},"Must Pay",null,{"$f":"COUNTIF(N511:N528,N529)","v":4}]
[null,"* Federal grants, subtract from basis",null,null,null,null,null,{"$f":"+H519+IF(I525=\"*\",H525,0)+IF(I526=\"*\",H526,0)+IF(I527=\"*\",H527,0)","v":0},"*",null,null,null,{"$f":"SUMIF(N511:N528,N530,M511:M528)","v":0},"All Pmts Deferred"]
[]
[null,{"$f":"IF(AND(H512>0,OR(H513>0,H514>0)),\"Potential error: New LHC Risk Share loan generally doesn't permit existing first or second mortgage loan to remain in place; please explain.\",\"\")","v":""}]
[null,{"$f":"IF(AND(H517>0,P529>1),\"Potential error: CDBG-DR generally permits only one 'must pay' debt; please explain.\",\"\")","v":""}]
[]
[null,"Comment"]
[]
[{"$f":"\"Section \"&L537","v":"Section 20"},"Construction / Development of the Project",null,null,null,null,null,null,null,"QAP Reference",null,{"$f":"+L510+1","v":20}]
[]
[{"$f":"+L539","v":20.010000000000002},"Do the estimated development costs for the project include costs for equipment owned by the Developer or Builder or any related party?",null,null,null,null,null,"No",null,{"$f":"+'QAP Reference'!A78","v":"IV.D"},null,{"$f":"+L537+0.01","v":20.010000000000002}]
[null,{"$f":"IF(H539=\"Yes\",\"Complete the remainder of Section \"&A539,\"Skip to Section \"&(A539+0.01))","v":"Skip to Section 20.02"}]
[]
[null,{"$f":"\"See QAP Section \"&J539&\" which discusses restrictions on costs related to these sorts of equipment. An information request will appear on the Checklist worksheet.\"","v":"See QAP Section IV.D which discusses restrictions on costs related to these sorts of equipment. An information request will appear on the Checklist worksheet."}]
[]
[null,"Estimated cost to the project, to lease this equipment.",null,null,null,null,null,0]
[]
[null,"Estimated cost to the project, to operate this equipment.",null,null,null,null,null,0]
[]
[null,"Comment"]
[]
[{"$f":"+L550","v":20.020000000000003},"See the QAP Section referenced to the right, which discusses limits on builder overhead and builder profit when a large proportion of the construction contract amount will be paid to a small number of subcontractors, material suppliers or equipment lessors.  Please list below the three subcontractors / material suppliers / equipment lessors to whom you expect to pay the largest amounts, and the estimated amount you expect to pay to each.",null,null,null,null,null,null,null,{"$f":"+'QAP Reference'!A79","v":"IV.D"},null,{"$f":"+L539+0.01","v":20.020000000000003}]
[]
[]
[]
[]
[]
[{"$f":"+L556","v":20.030000000000005},"If a non-LHC funder requires a third party construction manager, LHC is willing to consider allowing a Construction Manager's Fee. If you propose a non-zero fee, the Checklist will include an information request.",null,null,null,null,null,null,null,null,null,{"$f":"+L550+0.01","v":20.030000000000005}]
[null,"Construction Manager's Fee",null,null,null,null,null,0]
[]
[{"$f":"+L559","v":20.040000000000006},"Other than the developer fee, and the hard costs under the general construction contract, are there any estimated project costs that will be paid to the Developer, to related persons, or to persons with an identity of interest to the Developer?  If the general contractor and the Developer are related parties, be sure to list the General Requirements, General Overhead and Builder Fee/Profit below; it is not necessary to list the hard costs under the construction contract.",null,null,null,null,null,"Missing",null,"Glossary (definition of Developer Fee Base)",null,{"$f":"+L556+0.01","v":20.040000000000006}]
[null,{"$f":"IF(H559=\"Yes\",\"Detail each such payment below\",\"Skip to Section \"&(A559+0.01))","v":"Skip to Section 20.05"}]
[]
[null,"Payment 1",null,null,null,null,null,0]
[null,"Payment 2",null,null,null,null,null,0]
[null,"Payment 3",null,null,null,null,null,0]
[null,"Payment 4",null,null,null,null,null,0]
[null,"Payment 5",null,null,null,null,null,0]
[null,"Payment 6",null,null,null,null,null,0]
[]
[null,"Total Payments to Related Parties",null,null,null,null,null,{"$f":"SUM(H561:H568)","v":0}]
[]
[null,"Comment"]
[]
[{"$f":"+L573","v":20.050000000000008},{"$f":"\"Section \"&J573&M573","v":"Section IV.D of the QAP provides that Extraordinary Site Costs can be excluded from the Cost Limits calculations if they are recommended by the project's Architect / Engineer and if they are approved by LHC staff. An information request will appear on the Checklist worksheet."},null,null,null,null,null,null,null,{"$f":"+'QAP Reference'!A70","v":"IV.D"},null,{"$f":"+L559+0.01","v":20.050000000000008}," of the QAP provides that Extraordinary Site Costs can be excluded from the Cost Limits calculations if they are recommended by the project's Architect / Engineer and if they are approved by LHC staff. An information request will appear on the Checklist worksheet."]
[null,"Estimated cost for Extraordinary Site Costs",null,null,null,null,null,0]
[]
[{"$f":"+L576","v":20.060000000000009},"Please provide below the estimated cost of Community Facilities (including, without limitation, office space, maintenance storage, community room, community kitchen, recreational facilities and other ancillary / non-residential components of the project).  ",null,null,null,null,null,null,null,"Glossary",null,{"$f":"+L573+0.01","v":20.060000000000009}]
[]
[null,"Estimated cost for Community Facilities"]
[null,"Amount that is includable in LIHTC Basis",null,null,null,null,null,null,null,{"$f":"IF(H579>H578,\"Exceeds Total\",\"\")","v":""}]
[null,"Amount that is outside of LIHTC Basis",null,null,null,null,null,{"$f":"+H578-H579","v":0}]
[]
[null,"Please explain below what components of the project (for example, management office, community room, maintenance storage, tennis court, …) are included in your Community Facilities estimate.  Please explain your determination of the amount that is includable in LIHTC basis."]
[]
[]
[{"$f":"+L585","v":20.070000000000011},"Does the proposed project include a Community Service Facility (such as a childcare center or employment training center)?",null,null,null,null,null,"Missing",null,"Glossary",null,{"$f":"+L576+0.01","v":20.070000000000011}]
[null,{"$f":"IF(H585=\"Yes\",\"Explain below\",\"Skip to Section \"&(A585+0.01))","v":"Skip to Section 20.08"}]
[null,"Estimated cost for Community Service Facility",null,null,null,null,null,0]
[null,"Amount that is includable in LIHTC Basis",null,null,null,null,null,0,null,{"$f":"IF(H588>H587,\"Exceeds Total\",\"\")","v":""}]
[null,"Amount that is outside of LIHTC Basis",null,null,null,null,null,{"$f":"+H587-H588","v":0}]
[null,"An information request will appear on the Checklist worksheet."]
[null,"Comment"]
[]
[{"$f":"+L593","v":20.080000000000013},"Increases in Unit Costs Above the Maximum.",null,null,null,null,null,null,null,{"$f":"+'QAP Reference'!A70","v":"IV.D"},null,{"$f":"+L585+0.01","v":20.080000000000013}]
[null,"The QAP provides that Extraordinary Site costs, Community Facilities costs, and Community Service Facility costs are excluded from the cost limits computation.  In addition, the QAP provides that LHC staff have discretion to approve (or disapprove) increases in costs (other than Extraordinary Site Costs, Community Facilities costs, and Community Service Facility costs) up to 40% above the maximum."]
[null,"Does this transaction include a request that LHC staff grant the type of approval discussed immediately above?",null,null,null,null,null,"Missing"]
[null,{"$f":"IF(H595=\"Yes\",\"Explain below\",\"Skip to Section \"&(A593+0.01))","v":"Skip to Section 20.09"}]
[null,"Estimated excess costs",null,null,null,null,null,0]
[null,{"$f":"IF(AND(H595=\"Yes\",H597>0),\"An information request will appear on the Checklist worksheet.\",\"\")","v":""}]
[]
[{"$f":"+L600","v":20.090000000000014},"Building Configuration",null,null,null,null,null,null,null,null,null,{"$f":"+L593+0.01","v":20.090000000000014}]
[null,"A 'configuration' is a unique building, or a set of identical buildings"]
[null,"Total number of residential buildings in the project"]
[null,"Total number of building 'configurations' in the project"]
[]
[{"$f":"+L605","v":20.100000000000016},"Cash Flow Note for Acquisition of Existing Project",null,null,null,null,null,null,null,null,null,{"$f":"+L600+0.01","v":20.100000000000016}]
[null,"Does the financing plan include a cash flow note, associated with the acquisition of an existing project?  ",null,null,null,null,null,"Missing",null,{"$f":"+'QAP Reference'!A30","v":"IV.D.4"}]
[null,{"$f":"IF(H606=\"Yes\",\"An information request will appear on the Checklist worksheet\",\"Skip to Section \"&TEXT(A609,\"0.00\"))","v":"Skip to Section 20.11"}]
[]
[{"$f":"+L609","v":20.110000000000017},"Return on Taxpayer Capital",null,null,null,null,null,null,null,null,null,{"$f":"+L605+0.01","v":20.110000000000017}]
[null,"Are you claiming a Return on Taxpayer Capital, as provided for in the QAP, for projects with Soft Funds?",null,null,null,null,null,"Missing",null,{"$f":"+'QAP Reference'!A29","v":"IV.D.3"}]
[null,{"$f":"IF(H610=\"Yes\",\"An information request will appear on the Checklist worksheet\",\"Skip to Section \"&TEXT(A613,\"0.00\"))","v":"Skip to Section 20.12"}]
[]
[{"$f":"+L613","v":20.120000000000019},"Staff Units",null,null,null,null,null,null,null,null,null,{"$f":"+L609+0.01","v":20.120000000000019}]
[null,"Does the project include one or more staff units?",null,null,null,null,null,"Missing"]
[null,{"$f":"IF(H614=\"Yes\",\"See below\",\"Skip to Section \"&TEXT(L621,\"0.00\"))","v":"Skip to Section 20.14"},null,null,null,null,null,null,null,null,null,null,"Note -- if you intend to hold a LIHTC unit for a LIHTC-eligible staff member, that unit is not a \"staff unit\" for purposes of this Application; instead, it is simply a LIHTC unit. "]
[null,{"$f":"IF(H614=\"Yes\",M616,IF(H614=\"No\",M615,\"Select 'Yes' or 'No' above for detailed guidance.\"))","v":"Select 'Yes' or 'No' above for detailed guidance."},null,null,null,null,null,null,null,null,null,null,"On the Unit Mix and Rents sheet, designate the staff unit by selecting 'Yes' in the column labeled 'Staff Unit?'.  Note -- if you intend to hold a LIHTC unit for a LIHTC-eligible staff member, that unit is not a \"staff unit\" for purposes of this Application; instead, it is simply a LIHTC unit.  For Applicable Fraction purposes, a staff unit is not included in either the numerator or in the denominator of the Applicable Fraction calculations.  That is, an eight-unit building containing seven LIHTC units and one staff unit will have a 100% Applicable Fraction -- 7 divided by 7 = 100% -- by number of units.  Similarly, if all units have 1000 square feet each, the same building will have a 100% Applicable Fraction -- 7000 divided by 7000 = 100% -- by square footage.  The effective Applicable Fraction is the lesser of these two percentages."]
[null,{"$f":"IF(H614=\"Yes\",M617,\"\")","v":""},null,null,null,null,null,null,null,null,null,null,"For each staff unit, this Application expects the Unit Mix and Rents worksheet to reflect \"LIHTC?\" as \"No\", \"PSH\" as \"No\", \"% AMI Restriction\" as \"Not AMI Restricted\", and \"Rent\" as zero.  If you make other choices, there will be a Note on the Unit Mix and Rents worksheet requiring an explanation in the Checklist.  Note that LHC has been advised that the cost of a staff/management unit occupied by a non-low-income tenant will be includable in basis only if no rent is collected in connection with such staff/management unit."]
[]
[{"$f":"+L619","v":20.13000000000002},{"$f":"IF(OR(H614=\"Yes\",H578>0),M619,\"No staff units or Community Facilities; skip to Section \"&TEXT(A621,\"0.00\"))","v":"No staff units or Community Facilities; skip to Section 20.14"},null,null,null,null,null,null,null,null,null,{"$f":"+L613+0.01","v":20.13000000000002},"Note -- neither the square footage of staff units, nor the square footage of Community Facilities, is included in the calculation of Applicable Fraction by floor area.  That calculation includes only the floor area of residential units. Accordingly, a building that has four LIHTC units and four market rate units, each with 1000 square feet of floor area within the unit itself, will have an Applicable Fraction by square feet of 50% -- 4000 divided by 8000 = 50% -- regardless of whether the building also contains a staff unit and regardless of whether the building contains common areas such as a management office or community room."]
[]
[{"$f":"+L621","v":20.140000000000022},"Commercial Portion of the Project",null,null,null,null,null,null,null,null,null,{"$f":"+L619+0.01","v":20.140000000000022}]
[null,"Does the project include any commercial square footage and/or commercial development cost?",null,null,null,null,null,"Missing"]
[null,"Commercial square footage",null,null,null,null,null,0]
[null,"Commercial development cost",null,null,null,null,null,0]
[null,{"$f":"IF(H622=\"Yes\",\"A checklist item will be included.\",\"Skip to Section \"&TEXT(L627,\"0.00\"))","v":"Skip to Section 21.00"}]
[]
[{"$f":"\"Section \"&L627","v":"Section 21"},"Complete Remaining Key Worksheets For Underwriting",null,null,null,null,null,null,null,"QAP Reference",null,{"$f":"+L537+1","v":21}]
[]
[{"$f":"+L629","v":21.01},"Complete Section 23 below (information for rent limits)",null,null,null,null,null,"Not Started",null,null,null,{"$f":"+L627+0.01","v":21.01}]
[]
[{"$f":"+L631","v":21.020000000000003},"Complete the Unit Mix and Rents worksheet.",null,null,null,null,null,"Not Started",null,null,null,{"$f":"+L629+0.01","v":21.020000000000003},{"$f":"IF(H631=Controls!A228,0,1)","v":1}]
[null,null,null,null,null,null,null,null,null,null,null,null,null,null,null,null,{"$f":"+Controls!A63","v":"Missing"}]
[{"$f":"+L633","v":21.030000000000005},"Set-Aside Election",null,null,null,null,null,{"$f":"+M633","v":"Missing"},null,null,null,{"$f":"+L631+0.01","v":21.030000000000005},{"$f":"+H212","v":"Missing"},null,null,{"$f":"+'Unit Mix and Rents'!Y42","v":0},{"$f":"+Controls!A60","v":"20/50"}]
[null,{"$f":"IF(M633=Q635,\"Income Averaging Set-Aside Was Selected; Income Average is \"&TEXT(P633,\"0.0%\")&\"; \"&S634&\" Units at 70-80 AMI\",IF(M633=Q633,\"20/50 Set-Aside Was Selected; \"&M635,IF(M633=Q634,\"40/60 Set-Aside Was Selected; \"&M634,\"Set-Aside Selection Not Yet Made\")))","v":"Set-Aside Selection Not Yet Made"},null,null,null,null,null,null,null,null,null,null,{"$f":"+'Unit Mix and Rents'!I44","v":"Does not Meet 40/60 Setaside"},null,null,{"$f":"+'Unit Mix and Rents'!G44","v":0},{"$f":"+Controls!A61","v":"40/60"},null,{"$f":"+'Unit Mix and Rents'!Z41","v":0}]
[null,{"$f":"IF(AND(H633=Q635,P634<40%),\"Error: Not Eligible for Income Averaging; at least 40% Low Income Units required\",IF(AND(M633=Q635,P633>60%),\"Error: Not Eligible for Income Averaging; Income Average Exceeds 60%\",IF(AND(M633=Q633,'Unit Mix and Rents'!G50<20%),\"Error: Not Eligible for 20/50; Less Than 20% of Units Are At 50% AMI or Below\",IF(AND('Project Description'!M633='Project Description'!Q634,'Unit Mix and Rents'!G44<60%),\"Error: Not Eligible for 40/60; Less Than 40% of Units Are At 60% AMI or Below\",\"\"))))","v":""},null,null,null,null,null,null,null,null,null,null,{"$f":"+'Unit Mix and Rents'!I50","v":"Does not Meet 20/50 Setaside"},null,null,null,{"$f":"+Controls!A62","v":"Average Income"}]
[]
[{"$f":"+L637","v":21.040000000000006},"Total Project Square Footage",null,null,null,null,null,null,null,null,null,{"$f":"+L633+0.01","v":21.040000000000006}]
[]
[null,"Floor Area of Residential Units (see Unit Mix and Rents worksheet)",null,null,null,null,null,{"$f":"+'Unit Mix and Rents'!E56","v":0}]
[null,"Floor Area of Staff Units (see Unit Mix and Rents worksheet)",null,null,null,null,null,{"$f":"+'Unit Mix and Rents'!E55","v":0}]
[null,"Commercial Square Feet",null,null,null,null,null,{"$f":"+H623","v":0}]
[null,"Community Facilities (i.e., Common Areas) Sqft:",null,null,null,null,null,0]
[null,"Community Service Facility Sqft (if applicable):",null,null,null,null,null,0]
[null,"Other sqft (e.g. common hallways)",null,null,null,null,null,0,{"$f":"IF(H644=0,\"\",\"Explain below\")","v":""}]
[]
[null,"Total Square Footage for the Project",null,null,null,null,null,{"$f":"SUM(H638:H645)","v":0}]
[]
[null,"Comment"]
[]
[{"$f":"+L650","v":21.050000000000008},"Complete the Development Costs worksheet.",null,null,null,null,null,"Not Started",null,null,null,{"$f":"+L637+0.01","v":21.050000000000008},{"$f":"IF(H650=Controls!A228,0,1)","v":1}]
[]
[{"$f":"+L652","v":21.060000000000009},"Adjust any profit / fee amounts that exceed LHC limits.",null,null,null,null,null,"Not Started",null,null,null,{"$f":"+L650+0.01","v":21.060000000000009},{"$f":"IF(H652=Controls!A228,0,1)","v":1}]
[]
[{"$f":"+L654","v":21.070000000000011},"Complete the Syndication Certification worksheet.",null,null,null,null,null,"Not Started",null,null,null,{"$f":"+L652+0.01","v":21.070000000000011},{"$f":"IF(H654=Controls!A228,0,1)","v":1}]
[]
[{"$f":"+L656","v":21.080000000000013},"Complete the Basis Calculation worksheet.",null,null,null,null,null,"Not Started",null,null,null,{"$f":"+L654+0.01","v":21.080000000000013},{"$f":"IF(H656=Controls!A228,0,1)","v":1}]
[]
[{"$f":"+L658","v":21.090000000000014},"Complete the Revenues and Expenses worksheet.",null,null,null,null,null,"Not Started",null,null,null,{"$f":"+L656+0.01","v":21.090000000000014},{"$f":"IF(H658=Controls!A228,0,1)","v":1}]
[]
[{"$f":"+L660","v":21.100000000000016},"Complete the Developer Experience and Management Experience worksheets.",null,null,null,null,null,"Not Started",null,null,null,{"$f":"+L658+0.01","v":21.100000000000016},{"$f":"IF(H660=Controls!A228,0,1)","v":1}]
[{"$f":"IF(M661=0,0,\"Until you complete the worksheets listed above, results below will not be correct\")","v":"Until you complete the worksheets listed above, results below will not be correct"},null,null,null,null,null,null,null,null,null,null,null,{"$f":"SUM(M628:M660)","v":7}]
[]
[{"$f":"\"Section \"&L663","v":"Section 22"},"Allowable LIHTCs",null,null,null,null,null,null,null,"QAP Reference",null,{"$f":"+L627+1","v":22}]
[]
[{"$f":"+L665","v":22.01},"Allowable LIHTCs (Equity Gap Approach)",null,null,null,null,null,null,null,null,null,{"$f":"+L663+0.01","v":22.01}]
[]
[null,"Total Development Cost",null,null,null,null,null,{"$f":"+'Development Costs'!D140","v":0}]
[null,{"$f":"\"Subtract \"&B512","v":"Subtract New LHC Risk Sharing First Mortgage Loan"},null,null,null,null,null,{"$f":"-+H512","v":0}]
[null,{"$f":"\"Subtract \"&B513","v":"Subtract Other Loan With Must-Pay Debt Service"},null,null,null,null,null,{"$f":"-+H513","v":0}]
[null,{"$f":"\"Subtract \"&B514","v":"Subtract Non-LHC loan #2 (identify lender):"},null,null,null,null,null,{"$f":"-+H514","v":0}]
[null,{"$f":"\"Subtract \"&B518","v":"Subtract Deferred Developer Fee"},null,null,null,null,null,{"$f":"-+H518","v":0}]
[null,"Subtract Federal Historic Tax Credits",null,null,null,null,null,{"$f":"+-E419","v":0}]
[null,{"$f":"\"Subtract \"&B522","v":"Subtract Donated / Volunteer Labor"},null,null,null,null,null,{"$f":"-+H522","v":0}]
[null,"Subtract Donated Materials",null,null,null,null,null,0]
[null,"Subtract Donated Land Value",null,null,null,null,null,0]
[null,"Subtract Other Permanent Debt",null,null,null,null,null,0]
[null,"Subtract #2 (Explain)",null,null,null,null,null,0]
[null,"Subtract #3 (Explain)",null,null,null,null,null,0]
[]
[null,"Equity Gap before LIHTC Equity and LHC Funds",null,null,null,null,null,{"$f":"SUM(H666:H679)","v":0}]
[]
[null,"Anticipated Credit Pricing (per dollar)",null,null,null,null,null,{"$f":"+M682","v":0},null,null,null,null,{"$f":"+Syndication!M26","v":0},"from Syndication Certification"]
[null,"% of Credits to Investors",null,null,null,null,null,{"$f":"+M683","v":0},null,null,null,null,{"$f":"+Syndication!J19","v":0},"from Syndication Certification"]
[null,"Total Credit Needs Over Ten Years",null,null,null,null,null,{"$f":"IF(OR(H682=0,H683=0),0,(H680/H682)/H683)","v":0}]
[]
[null,"Credit Need by Equity Gap Approach",null,null,null,null,null,{"$f":"+H684/10","v":0}]
[]
[{"$f":"+L688","v":22.020000000000003},"Allowable LIHTCs (Basis Calculation Worksheet)",null,null,null,null,null,{"$f":"+'Basis Calculation'!C52","v":0},null,null,null,{"$f":"+L665+0.01","v":22.020000000000003}]
[]
[{"$f":"+L690","v":22.030000000000005},"Lower of the Two Methods",null,null,null,null,null,{"$f":"MIN(H688,H686)","v":0},null,null,null,{"$f":"+L688+0.01","v":22.030000000000005}]
[]
[{"$f":"+L692","v":22.040000000000006},"Total Credits Requested",null,null,null,null,null,{"$f":"+H204","v":0},null,null,null,{"$f":"+L690+0.01","v":22.040000000000006}]
[null,{"$f":"IF(ROUND(H692,0)<=ROUND(H690,0),\"\",\"Credit Request is Too High\")","v":""}]
[]
[null,"Comment Regarding Allowable LIHTCs"]
[]
[{"$f":"\"Section \"&L697","v":"Section 23"},"Information Related to Rent Limits",null,null,null,null,null,null,null,"QAP Reference",null,{"$f":"+L663+1","v":23}]
[]
[{"$f":"+L699","v":23.01},"National Non-Metropolitan Income Limit",null,null,null,null,null,null,null,null,null,{"$f":"+L697+0.01","v":23.01}]
[null,"If your property is located in a rural area as defined in Section 520 of the Housing Act of 1949, a \"Rural Project\" may use the higher of (a) the national non-metropolitan area median income or (b) the area median income for the Parish in which your project is located.  See the Glossary for the definition of \"Rural Project\"."]
[null,"Are you planning to use the national non-metropolitan income limit for this project?",null,null,null,null,null,"Yes",null,null,null,null,71300,"National non-metro limit as of FY 2022"]
[null,{"$f":"IF(H701=\"Yes\",\"An information request will appear on the Checklist worksheet\",\"Skip to Section \"&(A699+0.01))","v":"An information request will appear on the Checklist worksheet"}]
[null,{"$f":"IF(AND(H701=\"Yes\",H9=\"Yes\"),\"Cannot use the non-metro income limit; tax exempt bond financing is being used.\",\"\")","v":""}]
[]
[{"$f":"+L705","v":23.020000000000003},{"$f":"\"4 Person AMI for \"&TRIM(M705)&\" Parish\"","v":"4 Person AMI for Select Parish"},null,null,null,null,null,null,null,null,null,{"$f":"+L699+0.01","v":23.020000000000003},{"$f":"+E87","v":"Select"},{"$f":"+Q87","v":{"$error":"#N/A"}}]
[null,{"$f":"M706&\" (from LHC database)\"","v":" (from LHC database)"},null,null,null,null,null,{"$f":"IFERROR(+N705*2,\"Parish required on Row 82\")","v":"Parish required on Row 82"}]
[null,{"$f":"M707&\" (applicant's selection)\"","v":" (applicant's selection)"},null,null,null,null,null,{"$f":"+H706","v":"Parish required on Row 82"}]
[null,{"$f":"IFERROR(IF(ROUND(H707,0)<>ROUND(H706,0),\"Explain below\",\"Skip to Section \"&(A705+0.01)),\"\")","v":""}]
[null,"Comment"]
[]
[{"$f":"+L711","v":23.030000000000005},"AMI Gross Rents for the Project (including utilities, calculated by LHC; see the AMI Rents worksheet)",null,null,null,null,null,null,null,null,null,{"$f":"+L705+0.01","v":23.030000000000005}]
[]
[null,null,"\"Gross\" Rent Limits for AMI-Restricted Units"]
[null,null,{"$f":"+'AMI Rents'!B122","v":"0BR"},{"$f":"+'AMI Rents'!C122","v":"1BR"},{"$f":"+'AMI Rents'!D122","v":"2BR"},{"$f":"+'AMI Rents'!E122","v":"3BR"},{"$f":"+'AMI Rents'!F122","v":"4BR"}]
[null,{"$f":"+'AMI Rents'!A123","v":"120% AMI"},{"$f":"+'AMI Rents'!B123","v":{"$error":"#VALUE!"}},{"$f":"+'AMI Rents'!C123","v":{"$error":"#VALUE!"}},{"$f":"+'AMI Rents'!D123","v":{"$error":"#VALUE!"}},{"$f":"+'AMI Rents'!E123","v":{"$error":"#VALUE!"}},{"$f":"+'AMI Rents'!F123","v":{"$error":"#VALUE!"}}]
[null,{"$f":"+'AMI Rents'!A124","v":"20% AMI"},{"$f":"+'AMI Rents'!B124","v":{"$error":"#VALUE!"}},{"$f":"+'AMI Rents'!C124","v":{"$error":"#VALUE!"}},{"$f":"+'AMI Rents'!D124","v":{"$error":"#VALUE!"}},{"$f":"+'AMI Rents'!E124","v":{"$error":"#VALUE!"}},{"$f":"+'AMI Rents'!F124","v":{"$error":"#VALUE!"}}]
[null,{"$f":"+'AMI Rents'!A125","v":"30% AMI"},{"$f":"+'AMI Rents'!B125","v":{"$error":"#VALUE!"}},{"$f":"+'AMI Rents'!C125","v":{"$error":"#VALUE!"}},{"$f":"+'AMI Rents'!D125","v":{"$error":"#VALUE!"}},{"$f":"+'AMI Rents'!E125","v":{"$error":"#VALUE!"}},{"$f":"+'AMI Rents'!F125","v":{"$error":"#VALUE!"}}]
[null,{"$f":"+'AMI Rents'!A126","v":"40% AMI"},{"$f":"+'AMI Rents'!B126","v":{"$error":"#VALUE!"}},{"$f":"+'AMI Rents'!C126","v":{"$error":"#VALUE!"}},{"$f":"+'AMI Rents'!D126","v":{"$error":"#VALUE!"}},{"$f":"+'AMI Rents'!E126","v":{"$error":"#VALUE!"}},{"$f":"+'AMI Rents'!F126","v":{"$error":"#VALUE!"}}]
[null,{"$f":"+'AMI Rents'!A127","v":"50% AMI"},{"$f":"+'AMI Rents'!B127","v":{"$error":"#VALUE!"}},{"$f":"+'AMI Rents'!C127","v":{"$error":"#VALUE!"}},{"$f":"+'AMI Rents'!D127","v":{"$error":"#VALUE!"}},{"$f":"+'AMI Rents'!E127","v":{"$error":"#VALUE!"}},{"$f":"+'AMI Rents'!F127","v":{"$error":"#VALUE!"}}]
[null,{"$f":"+'AMI Rents'!A128","v":"60% AMI"},{"$f":"+'AMI Rents'!B128","v":{"$error":"#VALUE!"}},{"$f":"+'AMI Rents'!C128","v":{"$error":"#VALUE!"}},{"$f":"+'AMI Rents'!D128","v":{"$error":"#VALUE!"}},{"$f":"+'AMI Rents'!E128","v":{"$error":"#VALUE!"}},{"$f":"+'AMI Rents'!F128","v":{"$error":"#VALUE!"}}]
[null,{"$f":"+'AMI Rents'!A129","v":"70% AMI"},{"$f":"+'AMI Rents'!B129","v":{"$error":"#VALUE!"}},{"$f":"+'AMI Rents'!C129","v":{"$error":"#VALUE!"}},{"$f":"+'AMI Rents'!D129","v":{"$error":"#VALUE!"}},{"$f":"+'AMI Rents'!E129","v":{"$error":"#VALUE!"}},{"$f":"+'AMI Rents'!F129","v":{"$error":"#VALUE!"}}]
[null,{"$f":"+'AMI Rents'!A130","v":"80% AMI"},{"$f":"+'AMI Rents'!B130","v":{"$error":"#VALUE!"}},{"$f":"+'AMI Rents'!C130","v":{"$error":"#VALUE!"}},{"$f":"+'AMI Rents'!D130","v":{"$error":"#VALUE!"}},{"$f":"+'AMI Rents'!E130","v":{"$error":"#VALUE!"}},{"$f":"+'AMI Rents'!F130","v":{"$error":"#VALUE!"}}]
[]
[null,"The gross rents in the preceding table were calculated by LHC using the applicant's selected 100% AMI shown above.  Any utility allowances would need to be subtracted from these amounts.  If you disagree with these calculations, please include a comment below."]
[]
[]
[{"$f":"+L727","v":23.040000000000006},"Amenities and Heating System",null,null,null,null,null,null,null,null,null,{"$f":"+L711+0.01","v":23.040000000000006}]
[]
[null,"Amenities included in Units:"]
[null,"Oven / Range",null,null,null,null,null,"Missing"]
[null,"Refrigerator",null,null,null,null,null,"Missing"]
[null,"Microwave",null,null,null,null,null,"Missing"]
[null,"Dishwasher",null,null,null,null,null,"Missing"]
[null,"Garbage Disposal",null,null,null,null,null,"Missing"]
[null,"Washer / Dryer",null,null,null,null,null,"Missing"]
[null,"Washer / Dryer Hookup",null,null,null,null,null,"Missing"]
[]
[null,"Heating System:"]
[null,"Heating Fuel",null,null,null,null,null,"Missing"]
[null,"System Type",null,null,null,null,null,"Missing"]
[]
[null,"Comment"]
[]
[{"$f":"+L744","v":23.050000000000008},"Utilities Information",null,null,null,null,null,null,null,null,null,{"$f":"+L727+0.01","v":23.050000000000008}]
[]
[null,"Utility",null,"Fuel Source",null,null,null,"Utility Paid By"]
[null,"Cooking",null,"Missing",null,null,null,"Tenant"]
[null,"Other, Lighting",null,"Electric",null,null,null,"Tenant"]
[null,"Hot Water",null,"Missing",null,null,null,"Tenant"]
[null,"Water",null,null,null,null,null,"Tenant"]
[null,"Heating",null,{"$f":"+H739","v":"Missing"},null,null,null,"Tenant"]
[null,"Air Conditioning",null,"Electric",null,null,null,"Tenant"]
[null,"Sewer",null,null,null,null,null,"Tenant"]
[null,"Trash Collection",null,null,null,null,null,"Tenant"]
[]
[null,"Comment"]
[]
[{"$f":"+L758","v":23.060000000000009},"Utility Allowances Concluded by Applicant (for LIHTC Units)",null,null,null,null,null,null,null,null,null,{"$f":"+L744+0.01","v":23.060000000000009}]
[]
[null,"0 Bedroom Utility Allowance"]
[null,"1 Bedroom Utility Allowance"]
[null,"2 Bedroom Utility Allowance"]
[null,"3 Bedroom Utility Allowance"]
[null,"4 Bedroom Utility Allowance"]
[null,"The Checklist worksheet will include a request for appropriate documentation."]
[]
[{"$f":"+L767","v":23.070000000000011},"AMI \"Contract\" Rent Limits for the LIHTC Units (after subtracting Utility Allowances)",null,null,null,null,null,null,null,null,null,{"$f":"+L758+0.01","v":23.070000000000011}]
[]
[null,"The \"contract\" rents in the following table were calculated by LHC starting with the gross rents from the table above and subtracting the applicant's concluded utility allowances. That is, these are the maximum rents that the project could collect for LIHTC units with tenant incomes restricted at the AMI percentages shown below. If you disagree with these calculations, please include a comment below."]
[null,null,"\"Contract\" Rent Limits for LIHTC Units"]
[null,null,{"$f":"+C714","v":"0BR"},{"$f":"+D714","v":"1BR"},{"$f":"+E714","v":"2BR"},{"$f":"+F714","v":"3BR"},{"$f":"+G714","v":"4BR"}]
[null,{"$f":"+B715","v":"120% AMI"},{"$f":"+C715-H760","v":{"$error":"#VALUE!"}},{"$f":"+D715-H761","v":{"$error":"#VALUE!"}},{"$f":"+E715-H762","v":{"$error":"#VALUE!"}},{"$f":"+F715-H763","v":{"$error":"#VALUE!"}},{"$f":"+G715-H764","v":{"$error":"#VALUE!"}}]
[null,"20% AMI",{"$f":"+C716-H760","v":{"$error":"#VALUE!"}},{"$f":"+D716-H761","v":{"$error":"#VALUE!"}},{"$f":"+E716-H762","v":{"$error":"#VALUE!"}},{"$f":"+F716-H763","v":{"$error":"#VALUE!"}},{"$f":"+G716-H764","v":{"$error":"#VALUE!"}}]
[null,"30% AMI",{"$f":"+C717-H760","v":{"$error":"#VALUE!"}},{"$f":"+D717-H761","v":{"$error":"#VALUE!"}},{"$f":"+E717-H762","v":{"$error":"#VALUE!"}},{"$f":"+F717-H763","v":{"$error":"#VALUE!"}},{"$f":"+G717-H764","v":{"$error":"#VALUE!"}}]
[null,"40% AMI",{"$f":"+C718-H760","v":{"$error":"#VALUE!"}},{"$f":"+D718-H761","v":{"$error":"#VALUE!"}},{"$f":"+E718-H762","v":{"$error":"#VALUE!"}},{"$f":"+F718-H763","v":{"$error":"#VALUE!"}},{"$f":"+G718-H764","v":{"$error":"#VALUE!"}}]
[null,"50% AMI",{"$f":"+C719-H760","v":{"$error":"#VALUE!"}},{"$f":"+D719-H761","v":{"$error":"#VALUE!"}},{"$f":"+E719-H762","v":{"$error":"#VALUE!"}},{"$f":"+F719-H763","v":{"$error":"#VALUE!"}},{"$f":"+G719-H764","v":{"$error":"#VALUE!"}}]
[null,"60% AMI",{"$f":"+C720-H760","v":{"$error":"#VALUE!"}},{"$f":"+D720-H761","v":{"$error":"#VALUE!"}},{"$f":"+E720-H762","v":{"$error":"#VALUE!"}},{"$f":"+F720-H763","v":{"$error":"#VALUE!"}},{"$f":"+G720-H764","v":{"$error":"#VALUE!"}}]
[null,"70% AMI",{"$f":"+C721-H760","v":{"$error":"#VALUE!"}},{"$f":"+D721-H761","v":{"$error":"#VALUE!"}},{"$f":"+E721-H762","v":{"$error":"#VALUE!"}},{"$f":"+F721-H763","v":{"$error":"#VALUE!"}},{"$f":"+G721-H764","v":{"$error":"#VALUE!"}}]
[null,{"$f":"+B722","v":"80% AMI"},{"$f":"+C722-H760","v":{"$error":"#VALUE!"}},{"$f":"+D722-H761","v":{"$error":"#VALUE!"}},{"$f":"+E722-H762","v":{"$error":"#VALUE!"}},{"$f":"+F722-H763","v":{"$error":"#VALUE!"}},{"$f":"+G722-H764","v":{"$error":"#VALUE!"}}]
[]
[null,"Comment"]
[]
[{"$f":"+L783","v":23.080000000000013},"Estimated Market Rents and HUD Fair Market Rents",null,null,null,null,null,null,null,null,null,{"$f":"+L767+0.01","v":23.080000000000013}]
[]
[null,"Please enter below your estimated market rents, by number of bedrooms.  LHC understands that this is an estimate that will be confirmed later by the market study. The amounts entered below need to be the maximum rents that the project could collect for non-income-restricted units (that is, these rents need to be reduced to take into account any utilities that are tenant-paid).  If the project includes different types of (say) 1BR units with different market rents, enter the highest of those market rents."]
[null,null,"Market Rent Limits for the Project"]
[null,null,{"$f":"+C771","v":"0BR"},{"$f":"+D771","v":"1BR"},{"$f":"+E771","v":"2BR"},{"$f":"+F771","v":"3BR"},{"$f":"+G771","v":"4BR"}]
[{"$f":"+L788","v":23.090000000000014},"Market",612,739,861,1077,1248,null,null,null,null,{"$f":"+L783+0.01","v":23.090000000000014}]
[]
[null,"Comment Regarding Market Rents"]
[]
[null,{"$f":"\"Please enter the HUD Fair Market Rents that you believe are applicable to this project. The amounts on line \"&TEXT(A796,\"0.00\")&\" are the HUD \"&B796&\"s for \"&E87&\" Parish from LHC's database.  If you propose using different FMRs, please include an explanation below.\"","v":"Please enter the HUD Fair Market Rents that you believe are applicable to this project. The amounts on line 23.10 are the HUD FY2025 FMRs for Select Parish from LHC's database.  If you propose using different FMRs, please include an explanation below."}]
[]
[null,null,"Fair Market Rents for the Project"]
[null,null,{"$f":"+C787","v":"0BR"},{"$f":"+D787","v":"1BR"},{"$f":"+E787","v":"2BR"},{"$f":"+F787","v":"3BR"},{"$f":"+G787","v":"4BR"}]
[{"$f":"+L796","v":23.100000000000016},{"$f":"+Parishes!E7","v":"FY2025 FMR"},{"$f":"VLOOKUP('Project Description'!E87,Parishes!A10:AA73,5,FALSE)","v":{"$error":"#N/A"}},{"$f":"VLOOKUP('Project Description'!E87,Parishes!A10:AA73,6,FALSE)","v":{"$error":"#N/A"}},{"$f":"VLOOKUP('Project Description'!E87,Parishes!A10:AA73,7,FALSE)","v":{"$error":"#N/A"}},{"$f":"VLOOKUP('Project Description'!E87,Parishes!A10:AA73,8,FALSE)","v":{"$error":"#N/A"}},{"$f":"VLOOKUP('Project Description'!E87,Parishes!A10:AA73,9,FALSE)","v":{"$error":"#N/A"}},null,null,null,null,{"$f":"+L788+0.01","v":23.100000000000016}]
[{"$f":"+L797","v":23.110000000000017},"Selected FMR",{"$f":"+C796","v":{"$error":"#N/A"}},{"$f":"+D796","v":{"$error":"#N/A"}},{"$f":"+E796","v":{"$error":"#N/A"}},{"$f":"+F796","v":{"$error":"#N/A"}},{"$f":"+G796","v":{"$error":"#N/A"}},null,null,null,null,{"$f":"+L796+0.01","v":23.110000000000017}]
[null,{"$f":"IF(SUM(L798:R798)=0,\"\",S798&\" \"&T798&\" not match LHC's data; please explain discrepancies below.\")","v":{"$error":"#N/A"}},null,null,null,null,null,null,null,null,null,null,{"$f":"IF(C797=C796,0,1)","v":{"$error":"#N/A"}},{"$f":"IF(D797=D796,0,1)","v":{"$error":"#N/A"}},{"$f":"IF(E797=E796,0,1)","v":{"$error":"#N/A"}},{"$f":"IF(F797=F796,0,1)","v":{"$error":"#N/A"}},{"$f":"IF(G797=G796,0,1)","v":{"$error":"#N/A"}},null,{"$f":"SUM(L798:R798)","v":{"$error":"#N/A"}},{"$f":"IF(S798=1,\"FMR does\",\"FMRs do\")","v":{"$error":"#N/A"}}]
[null,"Comment Regarding FMRs"]
[]
[{"$f":"\"Section \"&L801","v":"Section 24"},"Targeted Population Type",null,null,null,null,null,null,null,"QAP Reference",null,{"$f":"+L697+1","v":24}]
[]
[{"$f":"+L803","v":24.01},"Do you intend to claim QAP points in Selection Criterion II.A Special Needs Households?",null,null,null,null,null,"Missing",null,{"$f":"+'QAP Reference'!A92","v":"Appendix A.II.A.i"},null,{"$f":"+L801+0.01","v":24.01}]
[null,{"$f":"IF(H803=\"Yes\",\"Complete the remainder of Section \"&A803,\"Skip to Section \"&(A803+0.01))","v":"Skip to Section 24.02"}]
[null,{"$f":"IF(H803=\"Yes\",\"There will be a question on the Checklist worksheet\",\"\")","v":""}]
[]
[{"$f":"+L807","v":24.020000000000003},"Will the project serve:",null,null,null,"Yes/No",null,"Number of Units",null,{"$f":"+'QAP Reference'!A92","v":"Appendix A.II.A.i"},null,{"$f":"+L803+0.01","v":24.020000000000003}]
[null,"Homeless Households",null,null,null,"Missing",null,null,null,null,null,null,{"$f":"IF(F808=\"Yes\",TRIM(B808),\"\")","v":""},null,null,{"$f":"IF(F808=\"Yes\",1,0)","v":0}]
[null,"Disabled Households",null,null,null,"Missing",null,null,null,null,null,null,{"$f":"IF(F809=\"Yes\",IF(P808>=1,\", \",\"\")&TRIM(B809)&\" \",\"\")","v":""},null,null,{"$f":"IF(F809=\"Yes\",1,0)+P808","v":0}]
[null,"Single Parent Households",null,null,null,"Missing",null,null,null,null,null,null,{"$f":"IF(F810=\"Yes\",IF(P809>=1,\", \",\"\")&TRIM(B810)&\" \",\"\")","v":""},null,null,{"$f":"IF(F810=\"Yes\",1,0)+P809","v":0}]
[null,"Veterans",null,null,null,"Missing",null,null,null,null,null,null,{"$f":"IF(F811=\"Yes\",IF(P810>=1,\", \",\"\")&TRIM(B811)&\" \",\"\")","v":""},null,null,{"$f":"IF(F811=\"Yes\",1,0)+P810","v":0}]
[null,null,null,null,null,null,null,null,null,null,null,null,{"$f":"SUM(H808:H812)","v":0},"total units"]
[null,"Special Needs Population:",null,null,{"$f":"M808&M809&M810&M811","v":""},null,null,null,null,null,null,null,{"$f":"IF('Unit Mix and Rents'!F41=0,0,+M812/'Unit Mix and Rents'!F41)","v":0},"of total units"]
[]
[{"$f":"+L815","v":24.030000000000005},"Are 100% of the project units designated for elderly households?",null,null,null,null,null,"Missing",null,{"$f":"+'QAP Reference'!A93","v":"Appendix A.II.A.ii"},null,{"$f":"+L807+0.01","v":24.030000000000005}]
[]
[{"$f":"\"Section \"&L817","v":"Section 25"},"Priority Development Areas and Other Preferences",null,null,null,null,null,null,null,"QAP Reference",null,{"$f":"+L801+1","v":25}]
[]
[{"$f":"+L819","v":25.01},"Do you intend to claim QAP points in Selection Criterion III.A Extended Affordability Agreement?",null,null,null,null,null,"Missing",null,{"$f":"+'QAP Reference'!A94","v":"Appendix A.III.A"},null,{"$f":"+L817+0.01","v":25.01}]
[null,{"$f":"IF(H819=\"Yes\",\"Complete the remainder of Section \"&A819,\"Skip to Section \"&(A819+0.01))","v":"Skip to Section 25.02"}]
[null,{"$f":"IF(H152=\"Yes\",\"Homeownership Projects not eligible for Extended Affordability; change Section \"&A819&\" to 'No'\",\"\")","v":""}]
[]
[null,"Do you agree to executed a written agreement, acceptable to LHC, in which the taxpayer waives its rights to Qualified Contract under the provisions of I.R.C.42(h)(6)(E) and (F)?",null,null,null,null,null,"Missing",null,{"$f":"+J819","v":"Appendix A.III.A"}]
[]
[null,"Please confirm the length of time of the waiver:",null,null,null,null,null,"Missing",null,{"$f":"+J819","v":"Appendix A.III.A"},null,null,{"$f":"IF(H825=Controls!A155,3,IF(H825=Controls!A156,4,IF(H825=Controls!A157,5,0)))","v":0}]
[]
[{"$f":"+L827","v":25.020000000000003},"Do you intend to claim QAP points in Selection Criterion III.D Additional Financial Support?",null,null,null,null,null,"Missing",null,{"$f":"+'QAP Reference'!A98","v":"Appendix A.III.D"},null,{"$f":"+L819+0.01","v":25.020000000000003}]
[null,{"$f":"IF(H827=\"Yes\",\"Complete Section \"&A830,\"Skip to Section \"&(A827+0.01))","v":"Skip to Section 25.03"}]
[]
[{"$f":"+L830","v":25.030000000000005},"What is the amount of Additional Financial Support, as defined in the QAP?",null,null,null,null,null,null,null,{"$f":"+J827","v":"Appendix A.III.D"},null,{"$f":"+L827+0.01","v":25.030000000000005},{"$f":"IF('Development Costs'!D140=0,0,+H830/'Development Costs'!D140)","v":0},"of TDC"]
[]
[{"$f":"\"Section \"&L832","v":"Section 26"},"Location Characteristics",null,null,null,null,null,null,null,"QAP Reference",null,{"$f":"+L817+1","v":26}]
[]
[{"$f":"+L834","v":26.01},"Positive Neighborhood Features (will be confirmed by Market Analyst)",null,null,null,null,null,null,null,{"$f":"+'QAP Reference'!A99","v":"Appendix A.IV.A"},null,{"$f":"+L832+0.01","v":26.01},{"$f":"SUM(M835:M856)","v":0}]
[null,"Grocery Store",null,null,null,null,null,"Missing",null,null,null,null,{"$f":"IF(H835=Controls!$C$162,1,IF(H835=Controls!$C$163,0.5,IF(H835=Controls!$E$162,1,0)))","v":0}]
[null,"Fresh produce market or fruit stand (must be located in a fixed structure)",null,null,null,null,null,"Missing",null,null,null,null,{"$f":"IF(H836=Controls!$C$162,1,IF(H836=Controls!$C$163,0.5,IF(H836=Controls!$E$162,1,0)))","v":0}]
[null,"Public Library",null,null,null,null,null,"Missing",null,null,null,null,{"$f":"IF(H837=Controls!$C$162,1,IF(H837=Controls!$C$163,0.5,IF(H837=Controls!$E$162,1,0)))","v":0}]
[null,"Hospital / Doctor Office or Clinic",null,null,null,null,null,"Missing",null,null,null,null,{"$f":"IF(H838=Controls!$C$162,1,IF(H838=Controls!$C$163,0.5,IF(H838=Controls!$E$162,1,0)))","v":0}]
[null,"Bank / Credit Unit with Live Tellers",null,null,null,null,null,"Missing",null,null,null,null,{"$f":"IF(H839=Controls!$C$162,1,IF(H839=Controls!$C$163,0.5,IF(H839=Controls!$E$162,1,0)))","v":0}]
[null,"Elementary, Secondary or Post Secondary School*",null,null,null,null,null,"Missing",null,null,null,null,{"$f":"IF(H840=Controls!$C$162,1,IF(H840=Controls!$C$163,0.5,IF(H840=Controls!$E$162,1,0)))","v":0}]
[null,"*4-Year College; University; or Voc/Tech/Comm College",null,null,null,null,null,"Missing",null,null,null,null,{"$f":"IF(H841=Controls!$C$162,1,IF(H841=Controls!$C$163,0.5,IF(H841=Controls!$E$162,1,0)))","v":0}]
[null,"Pharmacy / Drug Store (not including pharmacies with hospitals)",null,null,null,null,null,"Missing",null,null,null,null,{"$f":"IF(H842=Controls!$C$162,1,IF(H842=Controls!$C$163,0.5,IF(H842=Controls!$E$162,1,0)))","v":0}]
[null,"Public Transportation (shuttle services excluded)",null,null,null,null,null,"Missing",null,null,null,null,{"$f":"IF(H843=Controls!$C$162,1,IF(H843=Controls!$C$163,0.5,IF(H843=Controls!$E$162,1,0)))","v":0}]
[null,"LA Licensed (current) Adult/Child Day Care / After School Care",null,null,null,null,null,"Missing",null,null,null,null,{"$f":"IF(H844=Controls!$C$162,1,IF(H844=Controls!$C$163,0.5,IF(H844=Controls!$E$162,1,0)))","v":0}]
[null,"Recreational / Youth Center / Senior Center or Comparable",null,null,null,null,null,"Missing",null,null,null,null,{"$f":"IF(H845=Controls!$C$162,1,IF(H845=Controls!$C$163,0.5,IF(H845=Controls!$E$162,1,0)))","v":0}]
[null,"Public Park",null,null,null,null,null,"Missing",null,null,null,null,{"$f":"IF(H846=Controls!$C$162,1,IF(H846=Controls!$C$163,0.5,IF(H846=Controls!$E$162,1,0)))","v":0}]
[null,"Police or Fire Station",null,null,null,null,null,"Missing",null,null,null,null,{"$f":"IF(H847=Controls!$C$162,1,IF(H847=Controls!$C$163,0.5,IF(H847=Controls!$E$162,1,0)))","v":0}]
[null,"Laundry or Dry Cleaner",null,null,null,null,null,"Missing",null,null,null,null,{"$f":"IF(H848=Controls!$C$162,1,IF(H848=Controls!$C$163,0.5,IF(H848=Controls!$E$162,1,0)))","v":0}]
[null,"Gym or Health Club",null,null,null,null,null,"Missing",null,null,null,null,{"$f":"IF(H849=Controls!$C$162,1,IF(H849=Controls!$C$163,0.5,IF(H849=Controls!$E$162,1,0)))","v":0}]
[null,"Entertainment Facility "]
[null,"Movie theater",null,null,null,null,null,"Missing",null,null,null,null,{"$f":"IF(H851=Controls!$C$162,1,IF(H851=Controls!$C$163,0.5,IF(H851=Controls!$E$162,1,0)))","v":0}]
[null,"Bowling alley",null,null,null,null,null,"Missing",null,null,null,null,{"$f":"IF(H852=Controls!$C$162,1,IF(H852=Controls!$C$163,0.5,IF(H852=Controls!$E$162,1,0)))","v":0}]
[null,"Trampoline park",null,null,null,null,null,"Missing",null,null,null,null,{"$f":"IF(H853=Controls!$C$162,1,IF(H853=Controls!$C$163,0.5,IF(H853=Controls!$E$162,1,0)))","v":0}]
[null,"Laser tag",null,null,null,null,null,"Missing",null,null,null,null,{"$f":"IF(H854=Controls!$C$162,1,IF(H854=Controls!$C$163,0.5,IF(H854=Controls!$E$162,1,0)))","v":0}]
[null,"Other: ",null,null,null,null,null,"Missing",null,null,null,null,{"$f":"IF(H855=Controls!$C$162,1,IF(H855=Controls!$C$163,0.5,IF(H855=Controls!$E$162,1,0)))","v":0}]
[null,null,null,null,null,null,null,"Within 1 Mile Radius"]
[{"$f":"+L857","v":26.020000000000003},"Incompatible Uses",null,null,null,null,null,"The following incompatible uses will Comport with the QAP. Please explain any exceptions below.",null,{"$f":"+'QAP Reference'!A43","v":"IV.A.8"},null,{"$f":"+L834+0.01","v":26.020000000000003}]
[null,{"$f":"IF(M858=Controls!A44,TRIM(M858)&\"; continue with this Section \"&A857,\"Skip to Section \"&(A857+0.01))","v":"Skip to Section 26.03"},null,null,null,null,null,null,null,null,null,null,{"$f":"+H100","v":"Missing"},"[acquisition of any existing building]"]
[null,{"$f":"\"The project's location type is \"&M859","v":"The project's location type is "},null,null,null,null,null,null,null,null,null,null,{"$f":"+M138","v":""},null,null,{"$f":"+P138","v":5},"[1 = DUA  2 = small town  3 = other urban  4 = rural]"]
[null,{"$f":"IF(P859=2,\"Skip to Section \"&(A857+0.01),\"Complete the rest of Section \"&A857)","v":"Complete the rest of Section 26.02"},null,null,null,null,null,null,null,null,null,null,null,null,null,null,{"$f":"IF(M858=\"Yes\",2,CHOOSE(P859,1,2,1,2,2))","v":2},"1=negative feature prohibition applies"]
[null,null,null,null,null,null,null,null,null,null,null,null,{"$f":"SUM(M862:M872)","v":0}]
[null,"Junk Yard / Dump",null,null,null,null,null,"Missing",null,null,null,null,{"$f":"IF(H862=Controls!$A$167,-1,0)","v":0}]
[null,"Processing Plant",null,null,null,null,null,"Missing",null,null,null,null,{"$f":"IF(H863=Controls!$A$167,-1,0)","v":0}]
[null,"High Voltage Substation",null,null,null,null,null,"Missing",null,null,null,null,{"$f":"IF(H864=Controls!$A$167,-1,0)","v":0}]
[null,"Solid Waste Disposal",null,null,null,null,null,"Missing",null,null,null,null,{"$f":"IF(H865=Controls!$A$167,-1,0)","v":0}]
[null,"Heavy Industrial",null,null,null,null,null,"Missing",null,null,null,null,{"$f":"IF(H866=Controls!$A$167,-1,0)","v":0}]
[null,"Pig / Chicken Farm",null,null,null,null,null,"Missing",null,null,null,null,{"$f":"IF(H867=Controls!$A$167,-1,0)","v":0}]
[null,"Distribution Facility",null,null,null,null,null,"Missing",null,null,null,null,{"$f":"IF(H868=Controls!$A$167,-1,0)","v":0}]
[null,"Airport",null,null,null,null,null,"Missing",null,null,null,null,{"$f":"IF(H869=Controls!$A$167,-1,0)","v":0}]
[null,"Salvage Yard",null,null,null,null,null,"Missing",null,null,null,null,{"$f":"IF(H870=Controls!$A$167,-1,0)","v":0}]
[null,"Prison",null,null,null,null,null,"Missing",null,null,null,null,{"$f":"IF(H871=Controls!$A$167,-1,0)","v":0}]
[null,"Please explain"]
[null,{"$f":"IF(AND(Q860=1,M861<0),\"Error -- there is a prohibited nearby negative neighborhood feature.\",\"\")","v":""}]
[]
[{"$f":"\"Section \"&L875","v":"Section 27"},"Project Characteristics",null,null,null,null,null,null,null,"QAP Reference",null,{"$f":"+L832+1","v":27}]
[]
[{"$f":"+L877","v":27.01},"Does the project qualify as a Green Building under the QAP?",null,null,null,null,null,"Missing",null,{"$f":"'QAP Reference'!A102&\"; also Glossary\"","v":"Appendix A.V.B.iv; also Glossary"},null,{"$f":"+L875+0.01","v":27.01}]
[null,{"$f":"IF(H877=\"Yes\",\"There will be a question on the Checklist worksheet\",\"\")","v":""}]
[]
[{"$f":"+L880","v":27.020000000000003},"Does the project include Community Facilities as defined in the Glossary?",null,null,null,null,null,"Missing",null,{"$f":"'QAP Reference'!A100&\"; also Glossary\"","v":"Appendix A.V.A; also Glossary"},null,{"$f":"+L877+0.01","v":27.020000000000003}]
[]
[{"$f":"+L882","v":27.030000000000005},"Are washers and dryers installed and maintained in each unit?",null,null,null,null,null,"Missing",null,{"$f":"'QAP Reference'!A101&\"; also Glossary\"","v":"Appendix A.V.B; also Glossary"},null,{"$f":"+L880+0.01","v":27.030000000000005},{"$f":"IF(H882=\"Yes\",\"W/D\",\"\")","v":""}]
[null,"Are dishwashers installed and maintained in each unit?",null,null,null,null,null,"Missing",null,null,null,null,{"$f":"IF(H883<>\"Yes\",M882,IF(M882=\"\",\"DW\",M882&\", DW\"))","v":""}]
[null,"Free Development Tenant Wi-Fi",null,null,null,null,null,"Missing",null,null,null,null,null,null,null,null,null,null,null,null,null,null,null,null,null,null,null,null,null,null,null,null,null,null,null,null,null,null,null,null,null,null,null,null,null,null,null,null,null,null,null,null,null,null,null,null,null,null,null,null,null,null,null,null,null,null,null,null,null,null,null,null,null,null,null,null,null,null,null,null,null,null,null,null,null,null,null,null,null,null,null,null,null,null,null,null,null,null,null,null,null,null,null,null,null,null,null,null,null,null,null,null,null,null,null,null,null,null,null,null,null,null,null,null,null,null,null,null,null,null,null,null,null,null,null,null,null,null,null,null,null,null,null,null,null,null,null,null,null,null,null,null,null,null,null,null,null,null,null,null,null,null,null,null,null,null,null,null,null,null,null,null,null,null,null,null,null,null,null,null,null,null,null,null,null,null,null,null,null,null,null,null,null,null,null,null,null,null,null,null,{"$f":"IF(H888=\"Yes\",IF(H884<>\"Yes\",\"Required for Smart thermostat\",\"\"))","v":false}]
[null,"Does the project have Universal Design, as defined in the QAP?",null,null,null,null,null,"Missing"]
[null,"Does the project have HUD Defensible Space, as defined in the QAP?",null,null,null,null,null,"Missing",null,{"$f":"'QAP Reference'!A106&\"; also Glossary\"","v":"Appendix A.V.F; also Glossary"}]
[27.030999999999999,"The project will provide Federally Qualified Health Centers (FQHC) - Owners agree to host FQHCs onsite to provide tenants with access to preventive health services, dental services, mental health and/or substance abuse services, among others:",null,null,null,null,null,"Missing",null,null,null,null,null,"Added for2025 QAP"]
[27.032,"Does the project have Smart thermostat installed in each unit, as defined in the QAP? *must also provide Wi-Fi",null,null,null,null,null,"Missing",null,null,null,null,null,"Added for 2022/2021 QAP",null,null,null,null,null,null,null,null,null,null,null,null,null,null,null,null,null,null,null,null,null,null,null,null,null,null,null,null,null,null,null,null,null,null,null,null,null,null,null,null,null,null,null,null,null,null,null,null,null,null,null,null,null,null,null,null,null,null,null,null,null,null,null,null,null,null,null,null,null,null,null,null,null,null,null,null,null,null,null,null,null,null,null,null,null,null,null,null,null,null,null,null,null,null,null,null,null,null,null,null,null,null,null,null,null,null,null,null,null,null,null,null,null,null,null,null,null,null,null,null,null,null,null,null,null,null,null,null,null,null,null,null,null,null,null,null,null,null,null,null,null,null,null,null,null,null,null,null,null,null,null,null,null,null,null,null,null,null,null,null,null,null,null,null,null,null,null,null,null,null,null,null,null,null,null,null,null,null,null,null,null,null,null,null,null,null,{"$f":"IF(H888<>\"Yes\",\"\",IF(H884=\"Yes\",\"\",\"Development Wi-Fi must be provided\"))","v":""}]
[null,{"$f":"IF(H886=\"Yes\",\"The Checklist worksheet will include a question\",\"\")","v":""}]
[]
[{"$f":"+L891","v":27.040000000000006},"Which of the following are located on the project site?",null,null,null,null,null,null,null,null,null,{"$f":"+L882+0.01","v":27.040000000000006},{"$f":"SUM(M892:M905)","v":0}]
[null,"Playground",null,null,null,null,null,"Missing",null,{"$f":"+'QAP Reference'!A103","v":"Appendix A.V.C"},null,null,{"$f":"IF(H892=\"Yes\",1,0)","v":0}]
[null,"Basketball Court",null,null,null,null,null,"Missing"]
[null,{"$f":"\"Computer Center (at least 5 computers)\"","v":"Computer Center (at least 5 computers)"},null,null,null,null,null,"Missing",null,null,null,null,0,{"$f":"+'Unit Mix and Rents'!F41","v":0},"units = ",{"$f":"ROUNDUP(N894/10,0)","v":0}]
[null,"Exercise Room (must have equipment)",null,null,null,null,null,"Missing",null,null,null,null,0]
[null,"Picnic Area With Permanent Grill",null,null,null,null,null,"Missing",null,null,null,null,0]
[null,"Paved Walking Trail (minimum 1/4 mile)",null,null,null,null,null,"Missing"]
[null,"Off Street Parking",null,null,null,null,null,"Missing"]
[null,"Community Garden (as defined in QAP VII.V.D)",null,null,null,null,null,"Missing"]
[null,"Patio or Balcony",null,null,null,null,null,"Missing"]
[null,"Tennis Court",null,null,null,null,null,"Missing"]
[null,"Courtyard with Seating",null,null,null,null,null,"Missing",null,null,null,null,0]
[null,"Dog Park or Designated Pet Areas",null,null,null,null,null,"Missing"]
[null,"Open Access Multi-Purpose Tenant Activity Room",null,null,null,null,null,"Missing"]
[]
[{"$f":"+L906","v":27.050000000000008},"Accessible Units Required Under Section 504.",null,null,null,null,null,"Missing",null,{"$f":"+'QAP Reference'!A104","v":"Appendix A.V.D"},null,{"$f":"+L891+0.01","v":27.050000000000008}]
[null,{"$f":"\"Note: \"&TEXT(P907,\"0\")&\" \"&Q907&\" \"&R907&\" required to be accessible to people with mobility impairments.\"","v":"Note: 0 units are required to be accessible to people with mobility impairments."},null,null,null,null,null,null,null,null,null,null,null,{"$f":"+'Unit Mix and Rents'!F41","v":0},"units = ",{"$f":"ROUNDUP(N907*5%,0)","v":0},{"$f":"IF(P907=1,\"unit\",\"units\")","v":"units"},{"$f":"IF(P907=1,\"is\",\"are\")","v":"are"}]
[null,{"$f":"\"Note: \"&TEXT(P908,\"0\")&\" \"&Q908&\" \"&R908&\" required to be accessible to people with hearing or vision impairments.\"","v":"Note: 0 units are required to be accessible to people with hearing or vision impairments."},null,null,null,null,null,null,null,null,null,null,null,{"$f":"+'Unit Mix and Rents'!F41","v":0},"units = ",{"$f":"ROUNDUP(N908*2%,0)","v":0},{"$f":"IF(P908=1,\"unit\",\"units\")","v":"units"},{"$f":"IF(P908=1,\"is\",\"are\")","v":"are"}]
[]
[{"$f":"+L910","v":27.060000000000009},"How many total units in the project are accessible to people with mobility impairments (as defined under Section 504 of the Rehabilitation Act of 1973)?",null,null,null,null,null,null,null,null,null,{"$f":"+L906+0.01","v":27.060000000000009}]
[null,{"$f":"IF(H910>=P907,\"\",\"Error: Section 504 requires at least \"&TEXT(P907,\"0\")&\" \"&Q907&\" mobility-accessible.\")","v":""}]
[]
[{"$f":"+L913","v":27.070000000000011},"How many total units in the project are accessible to people with hearing or vision impairments (as defined under Section 504 of the Rehabilitation Act of 1973)?",null,null,null,null,null,null,null,null,null,{"$f":"+L910+0.01","v":27.070000000000011}]
[null,{"$f":"IF(H913>=P908,\"\",\"Error: Section 504 requires at least \"&TEXT(P908,\"0\")&\" \"&Q908&\" hearing-vision accessible.\")","v":""}]
[]
[{"$f":"+L916","v":27.080000000000013},"Does the project have Onsite Security as defined in the Glossary and in Selection Criterion V.E?",null,null,null,null,null,"Missing",null,{"$f":"'QAP Reference'!A105&\"; also Glossary\"","v":"Appendix A.V.E; also Glossary"},null,{"$f":"+L913+0.01","v":27.080000000000013}]
[null,{"$f":"IF(H916=\"Yes\",\"There will be a question on the Checklist worksheet\",\"\")","v":""},null,null,null,null,null,null,null,null,null,null,null,{"$f":"+'Unit Mix and Rents'!F41","v":0},"units = ",{"$f":"ROUNDUP(N917/20,0)","v":0},"cameras"]
[null,"Estimated Security Payroll / Contract Expense",null,null,null,null,null,{"$f":"+'Revenues and Expenses'!C58","v":0},null,{"$f":"\"See Section \"&TEXT('Revenues and Expenses'!A58,\"0.00\")","v":"See Section 44.27"}]
[null,"Will Security Cameras be included?",null,null,null,null,null,"Missing",null,null,null,null,{"$f":"IF(H919=\"Yes\",\"Cameras\",\"\")","v":""}]
[null,"Will a Security Gate be included?",null,null,null,null,null,"Missing",null,null,null,null,{"$f":"IF(H920<>\"Yes\",M919,IF(M919=\"\",\"Gate\",M919&\", Gate\"))","v":""}]
[null,"Will an On Site Security Guard be included?",null,null,null,null,null,"Missing",null,null,null,null,{"$f":"IF(H921<>\"Yes\",M920,IF(M920=\"\",\"Guard\",M920&\", Guard\"))","v":""}]
[null,"Will Security cameras connect with local town crime surveillance initiative?",null,null,null,null,null,"Missing",null,null,null,null,{"$f":"IF(H922=\"Yes\",\"Connect with surveillance initiative\",\"\")","v":""}]
[null,{"$f":"IF(H919<>\"Yes\",\"\",\"Note: the QAP requires at least \"&TEXT(P917,\"0\")&\" cameras.\")","v":""}]
[null,{"$f":"IF(AND(H916=\"Yes\",H918=0),\"Please explain why no annual security expense is budgeted.\",\"\")","v":""}]
[]
[27.09,"Does the project have any of the following Resiliency Standards, as defined in the QAP?",null,null,null,null,null,"Missing",null,{"$f":"'QAP Reference'!A107&\"; also Glossary\"","v":"Appendix A.V.G; also Glossary"}]
[null,"FORTIFIED Roof, windows and doors - REQUIRED",null,null,null,null,null,"Missing",null,{"$f":"IF(M928=\"Yes\",IF(H927=\"Yes\",\"\",\"Requried for Tier 1 or Tier 2 Parishes\"),\"\")","v":""}]
[null,"Located in a Tier 1 or Tier 2 Parish :",null,null,null,null,null,"Missing",null,{"$f":"IF(M928=\"Yes\",IF(H928=\"Yes\",\"\",\"Requried\"),\"\")","v":""},1,null,{"$f":"IFERROR(IF(VLOOKUP('Project Description'!N928,Parishes!A8:Z73,24)=N928,\"Yes\",\"\"),\"\")","v":""},{"$f":"E87","v":"Select"}]
[null,"FORTFIED SILVER:",null,null,null,null,null,"Missing"]
[]
[27.1,"Eviction Prevention and Low Barrier Tenant Screening"]
[null,"Does the project commit to creating an Eviction Prevention Plan for the property?",null,null,null,null,null,"Missing",null,{"$f":"'QAP Reference'!A108&\"; also Glossary\"","v":"Appendix A.V.H; also Glossary"}]
[null,"Does the project commits to implementing low-barrier tenant screening in order to minimize the impact of previous evictions on a household’s ability to secure future housing?",null,null,null,null,null,"Missing"]
[]
[27.11,"Material Participation of Minority, Women’s and Veteran’s Businesses"]
[null,"Professional Services/ General Contractor",null,null,null,null,null,"Missing",null,{"$f":"'QAP Reference'!A109&\"; also Glossary\"","v":"Appendix A.V.I; also Glossary"}]
[null,"Sub-Contractors/Vendors 1%-4.99% of Total Development Cost",null,null,null,null,null,"Missing"]
[null,"Sub-Contractors/Vendors >5% of Total Development Cost",null,null,null,null,null,"Missing"]
[]
[27.12,"Is this a Joint Venture property development with a",null,null,null,null,null,"Missing"]
[null,"Certified Minority Entity?",null,null,null,null,null,"Missing"]
[null,"Woman-Owned Business?",null,null,null,null,null,"Missing"]
[null,"Veteran-Owned Business?",null,null,null,null,null,"Missing"]
[null,"Service Disabled Veteran-Owned Business?",null,null,null,null,null,"Missing"]
[null,"or Qualified Small Business?",null,null,null,null,null,"Missing"]
[]
[]
[null,"Comment"]
[]
[{"$f":"\"Section \"&L950","v":"Section 28"},"Trending Rates for Cash Flow Pro Forma",null,null,null,null,null,null,null,"QAP Reference",null,{"$f":"+L875+1","v":28}]
[null,null,null,null,null,null,null,null,null,null,null,null,7.0000000000000007E-2,"Minimum Vacancy Rate for 11 Units or Less"]
[null,"Is the project in a soft market as determined by the commissioned market analyst?",null,null,null,null,null,"Missing",null,{"$f":"+'QAP Reference'!A31","v":"IV.D.5"}]
[null,{"$f":"IF(H952<>\"Yes\",\"Vacancy rate must match the LHC Standard\",\"Vacancy Rate must exceed the LHC Standard\")","v":"Vacancy rate must match the LHC Standard"}]
[]
[null,"Category",null,null,null,"LHC Std"]
[]
[null,"Vacancy Rate Years 1-3",null,null,null,{"$f":"+M957","v":7.0000000000000007E-2},null,{"$f":"+F957","v":7.0000000000000007E-2},null,{"$f":"+'QAP Reference'!A31","v":"IV.D.5"},null,null,7.0000000000000007E-2,"Minimum Vacancy Rate Year 1-3"]
[null,{"$f":"IF(H952<>\"Yes\",IF(H957<=F957,\"\",\"Vacancy rate (years 1-3) is too low; use at least \"&TEXT(F957,\"0.0%\")&\" instead.\"),IF(H957>F957,\"\",\"Soft market; use a vacancy rate above \"&TEXT(F957,\"0.0%\")&\" for years 1-3.\"))","v":""}]
[null,"Vacancy Rate Years 4+",null,null,null,7.0000000000000007E-2,null,{"$f":"+F959","v":7.0000000000000007E-2},null,{"$f":"+'QAP Reference'!A31","v":"IV.D.5"},null,null,7.0000000000000007E-2,"Minimum Vacancy Rate Year 4-15"]
[null,{"$f":"IF(H952<>\"Yes\",IF(H959<=F959,\"\",\"Vacancy rate (years 4+) is too low; use at least \"&TEXT(F959,\"0.0%\")&\" instead.\"),IF(H959>F959,\"\",\"Soft market; use a vacancy rate above \"&TEXT(F959,\"0.0%\")&\" for years 4+.\"))","v":""}]
[null,"Rent Inflation Rate Years 1-3",null,null,null,0.02,null,{"$f":"+F961","v":0.02},null,{"$f":"+'QAP Reference'!A27","v":"IV.D.1"},null,null,0.02,"Minimum Rent Inflation Rate Years 1-3"]
[null,{"$f":"IF(H961>F961,\"Rent Inflation (years 1-3) must be no higher than the LHC Standard \"&TEXT(F961,\"0.0%\")&\".\",\"\")","v":""}]
[null,"Minimum Rent Inflation Rate Years 4-15, 3% thereafter",null,null,null,0.02,null,{"$f":"+F963","v":0.02},null,{"$f":"+'QAP Reference'!A27","v":"IV.D.1"},null,null,0.02,"Minimum Rent Inflation Rate Years 4-15, 3% thereafter"]
[null,{"$f":"IF(H963>F963,\"Rent Inflation (years 4+) must be no higher than the LHC Standard \"&TEXT(F963,\"0.0%\")&\".\",\"\")","v":""}]
[null,"Expenses Inflation Rate (Standard)",null,null,null,0.03,null,null,null,null,null,null,0.03,"Minimum Expense Inflation Rate (Standard)"]
[null,"Expenses Inflation Rate (OCAF)",null,null,null,2.8000000000000001E-2,null,null,null,null,null,null,2.8000000000000001E-2,"Louisiana OCAF 2022 (FR 2021-10-04)"]
[null,"Selected Expenses Inflation Rate",null,null,null,null,null,{"$f":"+F965","v":0.03},null,{"$f":"+'QAP Reference'!A27","v":"IV.D.1"}]
[null,{"$f":"IF(H967<MIN(F965,F966),\"Selected expense Inflation rate must be at or above the LHC Standard \"&TEXT(MIN(F965,F966),\"0.0%\")&\".\",\"\")","v":""}]
[]
[null,"The QAP does not require that the annual deposit to replacement reserve (\"ADRR\") increase annually; however, other funders may have such a requirement.  If you include a non-zero trending rate for the ADRR, please include an appropriate explanation below."]
[null,"ADRR Escalation Rate",null,null,null,null,null,0]
[]
[null,"Comment on Trending Rates"]
[]
[{"$f":"\"Section \"&L975","v":"Section 29"},"Replacement Reserve Funding",null,null,null,null,null,null,null,"QAP Reference",null,{"$f":"+L950+1","v":29}]
[]
[null,"Does HUD or RD finance the first mortgage?",null,null,null,null,null,"Missing",null,{"$f":"+'QAP Reference'!A32","v":"IV.D.6"}]
[null,null,null,null,null,null,null,null,null,null,null,null,350,"new construction family",null,null,"Family","Added in 2025 QAP"]
[null,"Is the project a new construction project?",null,null,null,null,null,"Missing",null,{"$f":"+'QAP Reference'!A32","v":"IV.D.6"},null,null,300,"PUPA new constr. Seniors",null,null,"Seniors"]
[null,{"$f":"IF(H977=\"Yes\",\"Minimum Reserve deposit may be determined in accordance with HUD/RD policies.\",IF(H979=\"Yes\",\"Minimum Reserve deposit is \"&TEXT(M979,\"0\")&\" PUPA\",\"Minimum Reserve deposit is \"&TEXT(M980,\"0\")&\" PUPA\"))","v":"Minimum Reserve deposit is 500 PUPA"},null,null,null,null,null,null,null,null,null,null,500,"All other projects",null,null,"Missing"]
[]
[null,"Are there any requirements regarding the funding of the Replacement Reserve, other than LHC's requirements under the QAP?",null,null,null,null,null,"Missing"]
[null,{"$f":"IF(H982=\"Yes\",\"Explain those additional requirements in the comment box below\",\"\")","v":""}]
[]
[null,"Proposed annual Reserve deposit (PUPA)",null,null,null,null,null,500,null,{"$f":"+'QAP Reference'!A32","v":"IV.D.6"},null,null,{"$f":"IF(H979=Q979,M979,IF(H979=Q978,M978,M980))","v":500},"PUPA = LHC minimum"]
[null,{"$f":"IF(H977=\"Yes\",\"\",IF(H985>=M985,\"\",\"Proposed annual Reserve deposit must be at least \"&TEXT(M985,\"0\")&\" PUPA.\"))","v":""}]
[null,"Proposed annual Reserve deposit ( per year)",null,null,null,null,null,{"$f":"+H985*'Unit Mix and Rents'!F41","v":0}]
[]
[null,"Comment on annual Reserve deposit"]
[]
[null,{"$f":"\"Debt Service for \"&E294","v":"Debt Service for New LHC Risk Sharing First Mortgage Loan"},null,null,null,null,null,{"$f":"+E304","v":0}]
[null,{"$f":"\"Debt Service for \"&E310","v":"Debt Service for "},null,null,null,null,null,{"$f":"+E329","v":0}]
[null,{"$f":"\"Debt Service for \"&E335","v":"Debt Service for Non-LHC loan #2 (identify lender):"},null,null,null,null,null,{"$f":"+E354","v":0}]
[null,"Calculated Total Debt Service",null,null,null,null,null,{"$f":"SUM(H990:H993)","v":0}]
[]
[{"$f":"\"Section \"&L996","v":"Section 30"},"DSCR for First Stabilized Year",null,null,null,null,null,null,null,"QAP Reference",null,{"$f":"+L975+1","v":30}]
[]
[{"$f":"+L998","v":30.01},"Gross Potential Rental Income",null,null,null,null,null,{"$f":"+'Unit Mix and Rents'!L41*12","v":0},null,null,null,{"$f":"+L996+0.01","v":30.01}]
[{"$f":"+L999","v":30.020000000000003},"Rent Loss (years 1-3)",null,{"$f":"+H957","v":7.0000000000000007E-2},null,null,null,{"$f":"-ROUND(H998*D999,0)","v":0},null,null,null,{"$f":"+L998+0.01","v":30.020000000000003}]
[{"$f":"+L1000","v":30.030000000000005},"Other Income",null,null,null,null,null,{"$f":"SUM('Revenues and Expenses'!C11:C23)","v":0},null,null,null,{"$f":"+L999+0.01","v":30.030000000000005}]
[]
[{"$f":"+L1002","v":30.040000000000006},"Effective Gross Income",null,null,null,null,null,{"$f":"SUM(H997:H1001)","v":0},null,null,null,{"$f":"+L1000+0.01","v":30.040000000000006}]
[]
[{"$f":"+L1004","v":30.050000000000008},"Total Operating Expenses",null,null,null,null,null,{"$f":"+-'Revenues and Expenses'!C89","v":0},null,null,null,{"$f":"+L1002+0.01","v":30.050000000000008}]
[{"$f":"+L1005","v":30.060000000000009},"Replacement Reserve Deposit",null,null,null,null,null,{"$f":"+-H987","v":0},null,null,null,{"$f":"+L1004+0.01","v":30.060000000000009}]
[]
[{"$f":"+L1007","v":30.070000000000011},"Net Operating Income",null,null,null,null,null,{"$f":"SUM(H1002:H1006)","v":0},null,null,null,{"$f":"+L1005+0.01","v":30.070000000000011}]
[]
[null,"Must Pay Debt Service",null,null,null,null,null,null,null,null,null,{"$f":"+L1007+0.01","v":30.080000000000013}]
[{"$f":"+L1010","v":30.090000000000014},{"$f":"+E294","v":"New LHC Risk Sharing First Mortgage Loan"},null,null,null,null,null,{"$f":"+-E304","v":0},null,null,null,{"$f":"+L1009+0.01","v":30.090000000000014}]
[{"$f":"+L1011","v":30.100000000000016},{"$f":"IF(E310=0,\"Other Loan With Must-Pay Debt Service\",E310)","v":"Other Loan With Must-Pay Debt Service"},null,null,null,null,null,{"$f":"+-E329","v":0},null,null,null,{"$f":"+L1010+0.01","v":30.100000000000016}]
[{"$f":"+L1012","v":30.110000000000017},{"$f":"IF(E335=0,\"Other Loan With Must-Pay Debt Service\",E335)","v":"Non-LHC loan #2 (identify lender):"},null,null,null,null,null,{"$f":"+-E354","v":0},null,null,null,{"$f":"+L1011+0.01","v":30.110000000000017},{"$f":"-SUM(H1009:H1013)","v":0},"total must pay debt service"]
[]
[{"$f":"+L1014","v":30.120000000000019},"Operating Cash Flow (First Stabilized Year)",null,null,null,null,null,{"$f":"SUM(H1007:H1013)","v":0},null,null,null,{"$f":"+L1012+0.01","v":30.120000000000019},1.1499999999999999,"QAP minimum DSCR"]
[{"$f":"+L1015","v":30.13000000000002},"DSCR Year 1",{"$f":"IF(SUM(H1009:H1013)=0,\"\",IF(H1015>M1015,\"DSCR cannot exceed \"&TEXT(M1015,\"0.00\"),IF(H1015<M1014,\"Year 1 DSCR must be at least \"&TEXT(M1014,\"0.00\"),\"\")))","v":""},null,null,null,null,{"$f":"IF(M1012=0,0,+H1007/M1012)","v":0},null,null,null,{"$f":"+L1014+0.01","v":30.13000000000002},1.4,"QAP maximum DSCR"]
[]
[{"$f":"\"Section \"&L1017","v":"Section 31"},"Future Year DSCRs (see Proforma Worksheet)",null,null,null,null,null,null,null,"QAP Reference",null,{"$f":"+L996+1","v":31}]
[null,"Year 5",null,null,null,null,null,{"$f":"+Proforma!G44","v":0}]
[null,"Year 10",null,null,null,null,null,{"$f":"+Proforma!L44","v":0}]
[null,"Year 15",null,null,null,null,null,{"$f":"+Proforma!Q44","v":0},null,null,null,null,{"$f":"MAX(H1018:H1020)","v":0},"maximum years 1-15"]
[null,"Year 20",null,null,null,null,null,{"$f":"+Proforma!V44","v":0},null,null,null,null,{"$f":"MIN(H1018:H1020)","v":0},"minimum years 1-15"]
[null,"Year 25",null,null,null,null,null,{"$f":"+Proforma!AA44","v":0}]
[null,"Year 30",null,null,null,null,null,{"$f":"+Proforma!AF44","v":0}]
[null,"Year 35",null,null,null,null,null,{"$f":"+Proforma!AK44","v":0}]
[null,{"$f":"IF(M1020>1.4,\"Projected DSCR must not exceed 1.40 through year 15\",IF(AND(M1012>0,M1021<1),\"Projected DSCR must be at least 1.00 through year 15\",\"\"))","v":""},null,null,null,null,null,null,null,{"$f":"+'QAP Reference'!A28","v":"IV.D.2"}]
[]
[{"$f":"\"Section \"&L1027","v":"Section 32"},"LHC Fees",null,null,null,null,null,null,null,"QAP Reference",null,{"$f":"+L1017+1","v":32}]
[]
[{"$f":"+L1029","v":32.01},"LHC Application Fee (calculated)",null,null,null,null,null,{"$f":"IF(M1029<=Controls!C189,Controls!B189,IF(M1029<=Controls!C190,Controls!B190,IF(M1029<=Controls!C191,Controls!B191,IF(M1029<=Controls!C192,Controls!B192,Controls!B193))))","v":100},null,{"$f":"+'QAP Reference'!A25","v":"III.D"},null,{"$f":"+L1027+0.01","v":32.01},{"$f":"+'Unit Mix and Rents'!F41","v":0},"total units"]
[{"$f":"+L1030","v":32.019999999999996},"Application Fee amount",null,null,{"$f":"IF(ROUND(H1030,0)=ROUND(H1029,0),\"\",\"Please explain below.\")","v":""},null,null,{"$f":"+H1029","v":100},null,null,null,{"$f":"+L1029+0.01","v":32.019999999999996}]
[]
[{"$f":"+L1032","v":32.029999999999994},"LHC Analysis Fee (calculated)",null,null,null,null,null,{"$f":"IF(M1029<=Controls!C197,Controls!B197,IF(M1032<=Controls!C198,Controls!B198,IF(M1029<=Controls!C199,Controls!B199,IF(M1029<=Controls!C200,Controls!B200,Controls!B201))))","v":100},null,{"$f":"+'QAP Reference'!A25","v":"III.D"},null,{"$f":"+L1030+0.01","v":32.029999999999994},{"$f":"+'Unit Mix and Rents'!F41","v":0},"total units"]
[{"$f":"+L1033","v":32.039999999999992},"Analysis Fee amount",null,null,{"$f":"IF(ROUND(H1033,0)=ROUND(H1032,0),\"\",\"Please explain below.\")","v":""},null,null,{"$f":"+H1032","v":100},null,null,null,{"$f":"+L1032+0.01","v":32.039999999999992}]
[]
[{"$f":"+L1035","v":32.04999999999999},"LHC Market Study Fee (calculated)",null,null,null,null,null,{"$f":"+M1035","v":4800},null,{"$f":"+'QAP Reference'!A25","v":"III.D"},null,{"$f":"+L1033+0.01","v":32.04999999999999},4800]
[{"$f":"+L1036","v":32.059999999999988},"Market Study Fee amount",null,null,{"$f":"IF(ROUND(H1036,0)=ROUND(H1035,0),\"\",\"Please explain below.\")","v":""},null,null,{"$f":"+H1035","v":4800},null,null,null,{"$f":"+L1035+0.01","v":32.059999999999988}]
[]
[{"$f":"+L1038","v":32.069999999999986},"Is an LHC Subsidy Layering Review Fee required?",null,null,null,null,null,{"$f":"IF(H168=\"Yes\",\"Yes\",\"No\")","v":"No"},null,null,null,{"$f":"+L1036+0.01","v":32.069999999999986}]
[{"$f":"+L1039","v":32.079999999999984},"LHC Subsidy Layering Review Fee (calculated)",null,null,null,null,null,{"$f":"IF(H1038=\"Yes\",H1032/4,0)","v":0},null,{"$f":"+'QAP Reference'!A25","v":"III.D"},null,{"$f":"+L1038+0.01","v":32.079999999999984},4800]
[{"$f":"+L1040","v":32.089999999999982},"Subsidy Layering Review Fee amt",null,null,{"$f":"IF(ROUND(H1040,0)=ROUND(H1039,0),\"\",\"Please explain below.\")","v":""},null,null,{"$f":"+H1039","v":0},null,null,null,{"$f":"+L1039+0.01","v":32.089999999999982}]
[]
[{"$f":"+L1042","v":32.09999999999998},"LHC Annual Compliance / Monitoring Fee (calculated)",null,null,null,null,null,{"$f":"+M1042*M1043","v":0},null,{"$f":"+'QAP Reference'!A25","v":"III.D"},null,{"$f":"+L1040+0.01","v":32.09999999999998},{"$f":"+'Unit Mix and Rents'!F41","v":0},"total units"]
[{"$f":"+L1043","v":32.109999999999978},"LHC Annual Compl. / Monit. Fee ",null,null,{"$f":"IF(ROUND(H1043,0)=ROUND(H1042,0),\"\",\"Please explain below.\")","v":""},null,null,{"$f":"+H1042","v":0},null,null,null,{"$f":"+L1042+0.01","v":32.109999999999978},40]
[]
[{"$f":"+L1045","v":32.119999999999976},"LHC Asset Management Fee (calculated)",null,null,null,null,null,{"$f":"IF(M1029<=Controls!C232,Controls!B232,IF(M1029<=Controls!C233,Controls!B232,IF(M1029<=Controls!C234,Controls!B234,IF(M1029<=Controls!C235,Controls!B235,IF(M1029<=Controls!C236,Controls!B236,Controls!B240)))))","v":250},null,{"$f":"+'QAP Reference'!A28","v":"IV.D.2"},null,{"$f":"+L1043+0.01","v":32.119999999999976},{"$f":"+'Unit Mix and Rents'!F44","v":0},"total units",null,"Added in 2024 QAP"]
[{"$f":"+L1046","v":32.129999999999974},"LHC Asset Management Fee",null,null,{"$f":"IF(ROUND(H1046,0)=ROUND(H1045,0),\"\",\"Please explain below.\")","v":""},null,null,{"$f":"+H1045","v":250},null,null,null,{"$f":"+L1045+0.01","v":32.129999999999974},null,null,null,"Added in 2024 QAP"]
[null,null,null,null,null,null,null,null,null,null,null,null,{"$f":"COUNTIF(E1029:E1047,\"Please explain below.\")","v":0},"mismatches"]
[null,{"$f":"IF(M1047=0,\"\",\"Please explain any proposed fee amounts that differ from the calculated amounts.\")","v":""}]
[]
[null,"Comment"]
[]
[{"$f":"\"Section \"&L1052","v":"Section 33"},"Selection Criteria",null,null,null,null,null,null,null,null,null,{"$f":"+L1027+1","v":33}]
[]
[null,"Please review the Selection Criteria worksheet, to verify that you agree with the calculated point scores.  If the total calculated point score does not agree with your expectation, most likely the problem lies with your user inputs in this Application.  For example, if you did not receive points for Permanent Supportive Housing, make sure you indicated your PSH units on the Unit Mix and Rents worksheet.  If, after review, you believe that the calculated score is incorrect, please do the following:\n(1) Please realize that the calculated score may be incorrect, for example as the result of a programming error, or as the result of an LHC policy decision that is made after the completion of programming, or as the result of a change to the QAP after completion of programming.\n(2) On the Selection Criteria worksheet, whenever you think a calculated score is incorrect, enter (in column F) the points that you think LHC should award. You will see green background cells in column G indicating each difference between the calculated score and your self-score.\n(3) If you see any red background cell(s) in column G of the Selection Criteria worksheet, that indicates that your self-score exceeds maximums that are stated in the QAP.  The QAP indicates a maximum score for each Section.  In addition, in some Selection Criteria, only one selection is permitted (if you claim points for more than one such item, a red background cell will result). \n(4) Include an explanation below.  You can increase the size of the comment box as needed."]
[]
[null,{"$f":"\"The Selection Criteria worksheet indicates a score of \"&TEXT('Selection Criteria'!D129,\"0.0\")&\" points.\"","v":"The Selection Criteria worksheet indicates a score of 0.0 points."}]
[null,"Do you agree with that score?",null,null,null,null,null,"Missing"]
[]
[null,"Comment"]
[]
[{"$f":"\"Section \"&L1061","v":"Section 34"},"Applicant's Additional Explanation",null,null,null,null,null,null,null,"QAP Reference",null,{"$f":"+L1052+1","v":34}]
[]
[null,"The contents of the comment box below will appear on the Summary worksheet. You can re-size the comment box below by increasing the row height. After entering your comment, please check the Summary worksheet to be sure your entire comment appears (you can increase the row height in the Summary worksheet as needed)."]
[]
[]
[]
[]
[]
[{"$f":"\"Section \"&L1069","v":"Section 35"},"[RESERVED]",null,null,null,null,null,null,null,"QAP Reference",null,{"$f":"+L1061+1","v":35}]
[]
[null,null,null,null,null,null,null,null,null,null,null,{"$f":"+L1069","v":35},"= Last Section of this sheet"]

{"sheet":"QAP Reference","index":7,"n_rows":109,"n_cols":2,"rows_kept":109,"cut":false,"hidden":true,"merged":[]}
[]
[]
[{"$f":"+Instructions!A3","v":"2025 QAP Underwriting Application v1.1"}]
[]
["QAP References"]
["II.B","QAP is the governing document"]
["II.E","LA Public Records Law applies"]
[]
["II.A","Discusses Qualified Non-Profit"]
["II.A","Discusses CHDO"]
["II.A","Discusses funding pools"]
["II.B","Discusses LIHTC Per Project caps (by pool)"]
["IV.A.2.a","Discusses required priority for certain public housing waiting list applicants"]
["NA","Discusses National Housing Trust Fund"]
["Appendix C.N.","Discusses HOME funds"]
["Appendix C.N.","Discusses CDBG-DR funds"]
["II.B","LIHTC Per-Developer Cap"]
[]
["II.C","Discusses Basis Boost"]
["II.C","Discusses census tract median income data"]
[]
["III","Application Process requirements must be followed"]
["III.B","Processing for 9% Housing Credit applications"]
["III.C","Processing for 4% Housing Credit applications"]
["III.D","LHC Fee schedule"]
["IV.D","Requirements related to Pro Forma Cash Flows "]
["IV.D.1","Revenue and expense trending rates"]
["IV.D.2","Required debt service coverage ratios"]
["IV.D.3","Allowed Return on Taxpayer Capital"]
["IV.D.4","Cash flow note (for acquisition of existing project)"]
["IV.D.5","Minimum vacancy loss rate"]
["IV.D.6","Minimum annual Reserve deposit"]
["IV.D.9","Minimum operating expense level"]
["IV.D.12","Developer certification of sources and uses"]
[]
["IV.A.1","Threshold Requirement: Resiliency Construction Requirements for Tier 1 & Tier 2 Parishes"]
["IV.A.2","Threshold Requirement: Resiliency Standards (New Construction Only):"]
["IV.A.3","Threshold Requirement: 30% AMI and Target Population:"]
["IV.A.4","Threshold Requirement: Site Control"]
["IV.A.5","Threshold Requirement: Zoning"]
["IV.A.6","Threshold Requirement: Infrastructure"]
["IV.A.7","Threshold Requirement: Environmental Review"]
["IV.A.8","Threshold Requirement: Negative Neighborhood Features"]
["IV.A.9","Threshold Requirement: Taxpayer Agreement re Tenant Referrals"]
["IV.A.10","Threshold Requirement: Minimum Internet / Cable Requirements"]
["IV.B.4","Threshold Requirement: Amenities: On-site laundry or washers and dryers hookups installed"]
["IV.A.11","Threshold Requirement: Energy Efficiency"]
["IV.A.12","Threshold Requirement: Design Features"]
["IV.A.13","Threshold Requirements: Floodplain-related requirements"]
["IV.A.14","Threshold Requirement: Rehabilitation Projects"]
["IV.B.5","Threshold Requirement: Capital Needs Assessment"]
["IV.A.15","Threshold Requirement: Historic Rehabilitation Projects"]
["IV.A.16","Threshold Requirement: Projects with Federal Funds or Insurance:"]
["IV.A.17","Threshold Requirement: Legal Description of Project Property Site:"]
["IV.A.18","Threshold Requirement: Minimum Score"]
["IV.A.19","Threshold Requirement: LIHTC Compliance Training"]
["IV.A.20","Threshold Requirement: Eviction Prevention/Low Barrier Tenant Screening:"]
["IV.A.21","Threshold Requirement: Development Wi-Fi:"]
["IV.B.1","Audited Financials (acquisition of existing projects)"]
["IV.B.2","Requirements if seller and purchaser are Related Persons"]
["IV.B.3","Ten Year Title History"]
["IV.C.1  ","Eligibility criteria for Developers"]
["IV.C.1 .e ","Limitation for New Developers"]
["V.C.2","Eligibility criteria for Management Agents"]
["V.C.3","LHC has no liability for applicants' costs of submission"]
["V.C.3","Discussion of participants 'not in good standing' with LHC"]
["III.A","Local Community Notification"]
["Appendix B","Minimum Square Footage / Bathroom Requirements"]
["IV.D","Maximum Development Cost Requirements"]
["IV.D","Allows Extraordinary Site Costs to be excluded from the TDC limit computation"]
["IV.D","Allows Community Facilities and Community Service Facilities to be excluded from the TDC limit computation"]
["IV.D","SRO Project"]
["IV.D","Anti-discrimination project"]
["Appendix B","Construction and Design Standards"]
["Appendix B","Project Amenities"]
["IV.D","Fee and profit limits"]
["IV.D","Development Services Agreement"]
["IV.D","Discusses equipment owned by Developer, Builder or related party"]
["IV.D","Discusses limits to builder compensation, when a small number of subcontractors are responsible for a large percentage of construction cost"]
["IV.A","Discusses projects receiving federal financing / assistance"]
["V.H NA","Financing commitments"]
["IV.B.6","Appraisal requirements for value of acquired real estate"]
[]
["VI.A","Tenant Selection Plan"]
["VI.C","Applicant responsible to notify LHC of any material change"]
["VI.C","No site change permitted"]
["VI.C","Awarded projects are expected to be constructed as described"]
[]
["Appendix A","Disclaimer regarding Selection Criteria scoring"]
["Appendix A.I.A.ii","Geographic Diversity - NA"]
["Appendix A.I.B","Redevelopment Project"]
["Appendix A.II.A.i","Selection Criterion for Special Needs Households"]
["Appendix A.II.A.ii","Selection Criterion for Elderly Households"]
["Appendix A.III.A","Selection Criterion for Extended Affordability Agreement"]
["Appendix A.III.B","Selection Criterion for Increased Unit Affordability - NA"]
["Appendix A.III.B(i)(a)","Selection Criterion for Non-PSH Units Affordable At or Below 30% AMI - NA"]
["Appendix A.III.B(i)(b)","Selection Criterion for PSH Units - NA"]
["Appendix A.III.D","Selection Criterion for Additional Financial Support"]
["Appendix A.IV.A","Selection Criterion for Positive Neighborhood Features"]
["Appendix A.V.A","Selection Criterion for Community Facilities"]
["Appendix A.V.B","Selection Criterion for Optional Amenities"]
["Appendix A.V.B.iv","Selection Criterion for Green Building - NA"]
["Appendix A.V.C","Selection Criterion for Project Amenities"]
["Appendix A.V.D","Selection Criterion for Additional Accessibility"]
["Appendix A.V.E","Selection Criterion for On-Site Security"]
["Appendix A.V.F","Selection Criterion for HUD Defensible Space"]
["Appendix A.V.G","Selection Criterion for Resiliency Standards"]
["Appendix A.V.H","Threshold Requirment: for HUD Eviction Prevention and Low Barrier Tenant Screening"]
["Appendix A.V.I","Selection Criterion for Diversity, Equity & Inclusion - NA"]

{"sheet":"Unit Mix and Rents","index":8,"n_rows":77,"n_cols":51,"rows_kept":77,"cut":false,"hidden":false,"merged":[[4,20,7,20],[48,14,48,23],[6,8,7,8],[4,38,7,38],[4,32,7,32],[4,24,7,24],[4,25,7,25],[4,43,7,43],[62,0,62,12],[4,14,7,14],[4,29,7,29],[4,30,7,30],[4,31,7,31],[4,26,7,26],[4,17,7,17],[4,16,7,16],[4,18,7,18],[4,22,7,22],[4,23,7,23],[4,21,7,21],[4,15,7,15],[4,28,7,28],[4,19,7,19],[3,0,3,12],[4,49,7,49],[4,50,7,50],[4,27,7,27],[4,39,7,39],[4,40,7,40],[4,41,7,41],[4,46,7,46],[4,47,7,47],[4,48,7,48],[4,34,7,34],[4,35,7,35],[4,36,7,36],[4,42,7,42],[4,44,7,44],[4,33,7,33]]}
[]
[]
[{"$f":"+Instructions!A3","v":"2025 QAP Underwriting Application v1.1"}]
[{"$f":"TRIM('Project Description'!E84)&\" (\"&TRIM('Project Description'!E86)&\" LA), \"&'Project Description'!E50","v":" ( LA), "}]
[null,null,null,null,null,null,null,null,null,null,null,null,null,null,"LIHTC Count","Staff Unit Count","AMI Code","Units Below 60 AMI","Units Below 50 AMI","PSH Units","Non-PSH Units Below 30 AMI","Units Below 20 AMI","Units Below 80 AMI","Units Not AMI Restr.","LIHTC Income Average Calc","LIHTC Units at 70 or 80 AMI",null,"LIHTC Sqft","Staff Unit Sqft","Rental Subsidy Count","AMI Contract Rent Lookup","Column #","AMI Limit","FMR","Market Rent","Min. Sqft","Min. Baths",null,"AMI Flag","Market Flag","Sqft Flag","Baths Flag","PSH Flag","FMR Flag","Staff Unit Flag",null,"0 BR Count","1 BR Count","2 BR Count","3 BR Count","4 BR Count"]
["Unit Mix, Square Footage and Rents"]
[null,null,null,null,null,null,null,null,"Rental Subsidy?"]
["#","Unit Type","# BRs","# Baths","Sqft","# Units","LIHTC?","Staff Unit?",null,"PSH?","% AMI Restriction","Rent*","Notes**"]
[]
[1,{"$f":"IF(F10=0,\"\",TEXT(C10,\"0\")&\" BR \"&TEXT(D10,\"0.0\")&\" Bath\")","v":""},null,null,null,null,null,null,null,null,null,null,{"$f":"IF(AM10=1,\"1 \",\"\")&IF(AN10=2,\"2 \",\"\")&IF(AO10=3,\"3 \",\"\")&IF(AP10=4,\"4 \",\"\")&IF(AQ10=5,\"5 \",\"\")&IF(AR10=6,\"6 \",\"\")&IF(AS10=7,\"7 \",\"\")","v":""},null,{"$f":"IF(G10=\"Yes\",F10,0)","v":0},{"$f":"IF(AND(H10=\"Yes\",G10<>\"Yes\"),F10,0)","v":0},{"$f":"IF(K10=\"\",\"\",MATCH(K10,Controls!A143:A151,0))","v":""},{"$f":"IF(OR(Q10<2,Q10>6),0,F10)","v":0},{"$f":"IF(OR(Q10<2,Q10>5),0,F10)","v":0},{"$f":"IF(AND(J10=\"Yes\",OR(C10=0,C10=1),K10=Controls!A144),F10,0)","v":0},{"$f":"IF(AND(T10=0,OR(K10=Controls!A144,K10=Controls!A145)),F10,0)","v":0},{"$f":"IF(Q10=2,F10,0)","v":0},{"$f":"IF(OR(Q10<2,Q10>7),0,F10)","v":0},{"$f":"IF(Q10=9,F10,0)","v":0},{"$f":"IF(OR(O10=0, Q10<2, Q10>8),0,O10*Q10/10)","v":0},{"$f":"IF(OR(O10=0,Q10<7,Q10>8),0,O10)","v":0},null,{"$f":"IF(G10=\"Yes\",F10*E10,0)","v":0},{"$f":"IF(P10=0,0,F10*E10)","v":0},{"$f":"IF(I10=\"Yes\",F10,0)","v":0},{"$f":"IF(K10=\"\",\"\",VLOOKUP(K10,'Project Description'!B772:G779,'Unit Mix and Rents'!AF10,FALSE))","v":""},{"$f":"+C10+2","v":2},{"$f":"IF(ISNA(AE10),9999,AE10)","v":""},{"$f":"IF(F10=0,0,INDEX('Project Description'!C796:G797,2,C10+1))","v":0},{"$f":"IF(F10=0,0,INDEX('Project Description'!C788:G788,1,'Unit Mix and Rents'!C10+1))","v":0},{"$f":"IF(F10=0,0,INDEX(AE44:AI44,1,'Unit Mix and Rents'!C10+1))","v":0},{"$f":"IF(F10=0,0,INDEX(AE44:AI45,2,'Unit Mix and Rents'!C10+1))","v":0},null,{"$f":"IF(L10>AG10,1,\"\")","v":""},{"$f":"IF(L10>AI10,2,\"\")","v":""},{"$f":"IF(E10<AJ10,3,\"\")","v":""},{"$f":"IF(D10<AK10,4,\"\")","v":""},{"$f":"IF(J10<>\"Yes\",\"\",IF(AND(OR(C10=0,C10=1),K10=Controls!A144),\"\",5))","v":""},{"$f":"IF(L10>AH10,6,\"\")","v":""},{"$f":"IF(H10<>\"Yes\",\"\",IF(AND(G10<>\"Yes\",J10<>\"Yes\",K10=\"Not AMI Restricted\",L10=0),\"\",7))","v":""},null,{"$f":"IF(C10=0,F10,0)","v":0},{"$f":"IF(C10=1,F10,0)","v":0},{"$f":"IF(C10=2,F10,0)","v":0},{"$f":"IF(C10=3,F10,0)","v":0},{"$f":"IF(C10=4,F10,0)","v":0}]
[{"$f":"+A10+1","v":2},{"$f":"IF(F11=0,\"\",TEXT(C11,\"0\")&\" BR \"&TEXT(D11,\"0.0\")&\" Bath\")","v":""},null,null,null,null,null,null,null,null,null,null,{"$f":"IF(AM11=1,\"1 \",\"\")&IF(AN11=2,\"2 \",\"\")&IF(AO11=3,\"3 \",\"\")&IF(AP11=4,\"4 \",\"\")&IF(AQ11=5,\"5 \",\"\")&IF(AR11=6,\"6 \",\"\")&IF(AS11=7,\"7 \",\"\")","v":""},null,{"$f":"IF(G11=\"Yes\",F11,0)","v":0},0,{"$f":"IF(K11=\"\",\"\",MATCH(K11,Controls!A143:A151,0))","v":""},0,0,{"$f":"IF(J11=\"Yes\",F11,0)","v":0},{"$f":"IF(AND(T11=0,OR(K11=Controls!A144,K11=Controls!A145)),F11,0)","v":0},0,0,0,{"$f":"IF(OR(O11=0, Q11<2, Q11>8),0,O11*Q11/10)","v":0},{"$f":"IF(OR(O11=0,Q11<7,Q11>8),0,O11)","v":0},null,{"$f":"IF(G11=\"Yes\",F11*E11,0)","v":0},0,{"$f":"IF(I11=\"Yes\",F11,0)","v":0},{"$f":"IF(K11=\"\",\"\",VLOOKUP(K11,'Project Description'!B772:G779,'Unit Mix and Rents'!AF11,FALSE))","v":""},{"$f":"+C11+2","v":2},{"$f":"IF(ISNA(AE11),9999,AE11)","v":""},{"$f":"IF(F11=0,0,INDEX('Project Description'!C796:G797,2,C11+1))","v":0},{"$f":"IF(F11=0,0,INDEX('Project Description'!C788:G788,1,'Unit Mix and Rents'!C11+1))","v":0},{"$f":"IF(F11=0,0,INDEX(AE44:AI44,1,'Unit Mix and Rents'!C11+1))","v":0},{"$f":"IF(F11=0,0,INDEX(AE44:AI45,2,'Unit Mix and Rents'!C11+1))","v":0},null,{"$f":"IF(L11>AG11,1,\"\")","v":""},{"$f":"IF(L11>AI11,2,\"\")","v":""},{"$f":"IF(E11<AJ11,3,\"\")","v":""},{"$f":"IF(D11<AK11,4,\"\")","v":""},{"$f":"IF(J11<>\"Yes\",\"\",IF(AND(OR(C11=0,C11=1),K11=Controls!A144),\"\",5))","v":""},{"$f":"IF(L11>AH11,6,\"\")","v":""},"",null,0,0,0,0,0]
[{"$f":"+A11+1","v":3},"",null,null,null,null,null,null,null,null,null,null,"",null,{"$f":"IF(G12=\"Yes\",F12,0)","v":0},0,{"$f":"IF(K12=\"\",\"\",MATCH(K12,Controls!A143:A151,0))","v":""},0,0,{"$f":"IF(J12=\"Yes\",F12,0)","v":0},{"$f":"IF(AND(T12=0,OR(K12=Controls!A144,K12=Controls!A145)),F12,0)","v":0},0,0,0,0,0,null,{"$f":"IF(G12=\"Yes\",F12*E12,0)","v":0},0,{"$f":"IF(I12=\"Yes\",F12,0)","v":0},{"$f":"IF(K12=\"\",\"\",VLOOKUP(K12,'Project Description'!B772:G779,'Unit Mix and Rents'!AF12,FALSE))","v":""},{"$f":"+C12+2","v":2},{"$f":"IF(ISNA(AE12),9999,AE12)","v":""},{"$f":"IF(F12=0,0,INDEX('Project Description'!C796:G797,2,C12+1))","v":0},{"$f":"IF(F12=0,0,INDEX('Project Description'!C788:G788,1,'Unit Mix and Rents'!C12+1))","v":0},{"$f":"IF(F12=0,0,INDEX(AE44:AI44,1,'Unit Mix and Rents'!C12+1))","v":0},{"$f":"IF(F12=0,0,INDEX(AE44:AI45,2,'Unit Mix and Rents'!C12+1))","v":0},null,{"$f":"IF(L12>AG12,1,\"\")","v":""},{"$f":"IF(L12>AI12,2,\"\")","v":""},{"$f":"IF(E12<AJ12,3,\"\")","v":""},{"$f":"IF(D12<AK12,4,\"\")","v":""},{"$f":"IF(J12<>\"Yes\",\"\",IF(AND(OR(C12=0,C12=1),K12=Controls!A144),\"\",5))","v":""},{"$f":"IF(L12>AH12,6,\"\")","v":""},"",null,0,0,0,0,0]
[{"$f":"+A12+1","v":4},"",null,null,null,null,null,null,null,null,null,null,"",null,{"$f":"IF(G13=\"Yes\",F13,0)","v":0},0,{"$f":"IF(K13=\"\",\"\",MATCH(K13,Controls!A143:A151,0))","v":""},0,0,{"$f":"IF(J13=\"Yes\",F13,0)","v":0},{"$f":"IF(AND(T13=0,OR(K13=Controls!A144,K13=Controls!A145)),F13,0)","v":0},0,0,0,0,0,null,{"$f":"IF(G13=\"Yes\",F13*E13,0)","v":0},0,{"$f":"IF(I13=\"Yes\",F13,0)","v":0},{"$f":"IF(K13=\"\",\"\",VLOOKUP(K13,'Project Description'!B772:G779,'Unit Mix and Rents'!AF13,FALSE))","v":""},{"$f":"+C13+2","v":2},{"$f":"IF(ISNA(AE13),9999,AE13)","v":""},{"$f":"IF(F13=0,0,INDEX('Project Description'!C796:G797,2,C13+1))","v":0},{"$f":"IF(F13=0,0,INDEX('Project Description'!C788:G788,1,'Unit Mix and Rents'!C13+1))","v":0},{"$f":"IF(F13=0,0,INDEX(AE44:AI44,1,'Unit Mix and Rents'!C13+1))","v":0},{"$f":"IF(F13=0,0,INDEX(AE44:AI45,2,'Unit Mix and Rents'!C13+1))","v":0},null,{"$f":"IF(L13>AG13,1,\"\")","v":""},{"$f":"IF(L13>AI13,2,\"\")","v":""},{"$f":"IF(E13<AJ13,3,\"\")","v":""},{"$f":"IF(D13<AK13,4,\"\")","v":""},{"$f":"IF(J13<>\"Yes\",\"\",IF(AND(OR(C13=0,C13=1),K13=Controls!A144),\"\",5))","v":""},{"$f":"IF(L13>AH13,6,\"\")","v":""},{"$f":"IF(H13<>\"Yes\",\"\",IF(AND(G13<>\"Yes\",J13<>\"Yes\",K13=\"Not AMI Restricted\",L13=0),\"\",7))","v":""},null,0,0,0,0,0]
[{"$f":"+A13+1","v":5},"",null,null,null,null,null,null,null,null,null,null,"",null,{"$f":"IF(G14=\"Yes\",F14,0)","v":0},0,{"$f":"IF(K14=\"\",\"\",MATCH(K14,Controls!A143:A151,0))","v":""},0,0,{"$f":"IF(J14=\"Yes\",F14,0)","v":0},{"$f":"IF(AND(T14=0,OR(K14=Controls!A144,K14=Controls!A145)),F14,0)","v":0},0,0,0,0,0,null,{"$f":"IF(G14=\"Yes\",F14*E14,0)","v":0},0,{"$f":"IF(I14=\"Yes\",F14,0)","v":0},{"$f":"IF(K14=\"\",\"\",VLOOKUP(K14,'Project Description'!B772:G779,'Unit Mix and Rents'!AF14,FALSE))","v":""},{"$f":"+C14+2","v":2},{"$f":"IF(ISNA(AE14),9999,AE14)","v":""},{"$f":"IF(F14=0,0,INDEX('Project Description'!C796:G797,2,C14+1))","v":0},{"$f":"IF(F14=0,0,INDEX('Project Description'!C788:G788,1,'Unit Mix and Rents'!C14+1))","v":0},{"$f":"IF(F14=0,0,INDEX(AE44:AI44,1,'Unit Mix and Rents'!C14+1))","v":0},{"$f":"IF(F14=0,0,INDEX(AE44:AI45,2,'Unit Mix and Rents'!C14+1))","v":0},null,{"$f":"IF(L14>AG14,1,\"\")","v":""},{"$f":"IF(L14>AI14,2,\"\")","v":""},{"$f":"IF(E14<AJ14,3,\"\")","v":""},{"$f":"IF(D14<AK14,4,\"\")","v":""},{"$f":"IF(J14<>\"Yes\",\"\",IF(AND(OR(C14=0,C14=1),K14=Controls!A144),\"\",5))","v":""},{"$f":"IF(L14>AH14,6,\"\")","v":""},{"$f":"IF(H14<>\"Yes\",\"\",IF(AND(G14<>\"Yes\",J14<>\"Yes\",K14=\"Not AMI Restricted\",L14=0),\"\",7))","v":""},null,0,0,0,0,0]
[6,"",null,null,null,null,null,null,null,null,null,null,"",null,0,0,{"$f":"IF(K15=\"\",\"\",MATCH(K15,Controls!A143:A151,0))","v":""},0,0,0,{"$f":"IF(AND(T15=0,OR(K15=Controls!A144,K15=Controls!A145)),F15,0)","v":0},0,0,0,0,0,null,0,0,0,{"$f":"IF(K15=\"\",\"\",VLOOKUP(K15,'Project Description'!B772:G779,'Unit Mix and Rents'!AF15,FALSE))","v":""},2,"",{"$f":"IF(F15=0,0,INDEX('Project Description'!C796:G797,2,C15+1))","v":0},{"$f":"IF(F15=0,0,INDEX('Project Description'!C788:G788,1,'Unit Mix and Rents'!C15+1))","v":0},{"$f":"IF(F15=0,0,INDEX(AE44:AI44,1,'Unit Mix and Rents'!C15+1))","v":0},{"$f":"IF(F15=0,0,INDEX(AE44:AI45,2,'Unit Mix and Rents'!C15+1))","v":0},null,"","","","",{"$f":"IF(J15<>\"Yes\",\"\",IF(AND(OR(C15=0,C15=1),K15=Controls!A144),\"\",5))","v":""},"","",null,0,0,0,0,0]
[7,"",null,null,null,null,null,null,null,null,null,null,"",null,0,0,{"$f":"IF(K16=\"\",\"\",MATCH(K16,Controls!A143:A151,0))","v":""},0,0,0,{"$f":"IF(AND(T16=0,OR(K16=Controls!A144,K16=Controls!A145)),F16,0)","v":0},0,0,0,0,0,null,0,0,0,{"$f":"IF(K16=\"\",\"\",VLOOKUP(K16,'Project Description'!B772:G779,'Unit Mix and Rents'!AF16,FALSE))","v":""},2,"",{"$f":"IF(F16=0,0,INDEX('Project Description'!C796:G797,2,C16+1))","v":0},{"$f":"IF(F16=0,0,INDEX('Project Description'!C788:G788,1,'Unit Mix and Rents'!C16+1))","v":0},{"$f":"IF(F16=0,0,INDEX(AE44:AI44,1,'Unit Mix and Rents'!C16+1))","v":0},{"$f":"IF(F16=0,0,INDEX(AE44:AI45,2,'Unit Mix and Rents'!C16+1))","v":0},null,"","","","",{"$f":"IF(J16<>\"Yes\",\"\",IF(AND(OR(C16=0,C16=1),K16=Controls!A144),\"\",5))","v":""},"","",null,0,0,0,0,0]
[8,"",null,null,null,null,null,null,null,null,null,null,"",null,0,0,{"$f":"IF(K17=\"\",\"\",MATCH(K17,Controls!A143:A151,0))","v":""},0,0,0,{"$f":"IF(AND(T17=0,OR(K17=Controls!A144,K17=Controls!A145)),F17,0)","v":0},0,0,0,0,0,null,0,0,0,{"$f":"IF(K17=\"\",\"\",VLOOKUP(K17,'Project Description'!B772:G779,'Unit Mix and Rents'!AF17,FALSE))","v":""},2,"",{"$f":"IF(F17=0,0,INDEX('Project Description'!C796:G797,2,C17+1))","v":0},{"$f":"IF(F17=0,0,INDEX('Project Description'!C788:G788,1,'Unit Mix and Rents'!C17+1))","v":0},{"$f":"IF(F17=0,0,INDEX(AE44:AI44,1,'Unit Mix and Rents'!C17+1))","v":0},{"$f":"IF(F17=0,0,INDEX(AE44:AI45,2,'Unit Mix and Rents'!C17+1))","v":0},null,"","","","",{"$f":"IF(J17<>\"Yes\",\"\",IF(AND(OR(C17=0,C17=1),K17=Controls!A144),\"\",5))","v":""},"","",null,0,0,0,0,0]
[9,"",null,null,null,null,null,null,null,null,null,null,"",null,0,0,{"$f":"IF(K18=\"\",\"\",MATCH(K18,Controls!A143:A151,0))","v":""},0,0,0,{"$f":"IF(AND(T18=0,OR(K18=Controls!A144,K18=Controls!A145)),F18,0)","v":0},0,0,0,0,0,null,0,0,0,{"$f":"IF(K18=\"\",\"\",VLOOKUP(K18,'Project Description'!B772:G779,'Unit Mix and Rents'!AF18,FALSE))","v":""},2,"",{"$f":"IF(F18=0,0,INDEX('Project Description'!C796:G797,2,C18+1))","v":0},{"$f":"IF(F18=0,0,INDEX('Project Description'!C788:G788,1,'Unit Mix and Rents'!C18+1))","v":0},{"$f":"IF(F18=0,0,INDEX(AE44:AI44,1,'Unit Mix and Rents'!C18+1))","v":0},{"$f":"IF(F18=0,0,INDEX(AE44:AI45,2,'Unit Mix and Rents'!C18+1))","v":0},null,"","","","",{"$f":"IF(J18<>\"Yes\",\"\",IF(AND(OR(C18=0,C18=1),K18=Controls!A144),\"\",5))","v":""},"","",null,0,0,0,0,0]
[10,"",null,null,null,null,null,null,null,null,null,null,"",null,0,0,{"$f":"IF(K19=\"\",\"\",MATCH(K19,Controls!A143:A151,0))","v":""},0,0,0,{"$f":"IF(AND(T19=0,OR(K19=Controls!A144,K19=Controls!A145)),F19,0)","v":0},0,0,0,0,0,null,0,0,0,{"$f":"IF(K19=\"\",\"\",VLOOKUP(K19,'Project Description'!B772:G779,'Unit Mix and Rents'!AF19,FALSE))","v":""},2,"",{"$f":"IF(F19=0,0,INDEX('Project Description'!C796:G797,2,C19+1))","v":0},{"$f":"IF(F19=0,0,INDEX('Project Description'!C788:G788,1,'Unit Mix and Rents'!C19+1))","v":0},{"$f":"IF(F19=0,0,INDEX(AE44:AI44,1,'Unit Mix and Rents'!C19+1))","v":0},{"$f":"IF(F19=0,0,INDEX(AE44:AI45,2,'Unit Mix and Rents'!C19+1))","v":0},null,"","","","",{"$f":"IF(J19<>\"Yes\",\"\",IF(AND(OR(C19=0,C19=1),K19=Controls!A144),\"\",5))","v":""},"","",null,0,0,0,0,0]
[11,"",null,null,null,null,null,null,null,null,null,null,"",null,0,0,{"$f":"IF(K20=\"\",\"\",MATCH(K20,Controls!A143:A151,0))","v":""},0,0,0,{"$f":"IF(AND(T20=0,OR(K20=Controls!A144,K20=Controls!A145)),F20,0)","v":0},0,0,0,0,0,null,0,0,0,{"$f":"IF(K20=\"\",\"\",VLOOKUP(K20,'Project Description'!B772:G779,'Unit Mix and Rents'!AF20,FALSE))","v":""},2,"",{"$f":"IF(F20=0,0,INDEX('Project Description'!C796:G797,2,C20+1))","v":0},{"$f":"IF(F20=0,0,INDEX('Project Description'!C788:G788,1,'Unit Mix and Rents'!C20+1))","v":0},{"$f":"IF(F20=0,0,INDEX(AE44:AI44,1,'Unit Mix and Rents'!C20+1))","v":0},{"$f":"IF(F20=0,0,INDEX(AE44:AI45,2,'Unit Mix and Rents'!C20+1))","v":0},null,"","","","",{"$f":"IF(J20<>\"Yes\",\"\",IF(AND(OR(C20=0,C20=1),K20=Controls!A144),\"\",5))","v":""},"","",null,0,0,0,0,0]
[12,"",null,null,null,null,null,null,null,null,null,null,"",null,0,0,{"$f":"IF(K21=\"\",\"\",MATCH(K21,Controls!A143:A151,0))","v":""},0,0,0,{"$f":"IF(AND(T21=0,OR(K21=Controls!A144,K21=Controls!A145)),F21,0)","v":0},0,0,0,0,0,null,0,0,0,{"$f":"IF(K21=\"\",\"\",VLOOKUP(K21,'Project Description'!B772:G779,'Unit Mix and Rents'!AF21,FALSE))","v":""},2,"",{"$f":"IF(F21=0,0,INDEX('Project Description'!C796:G797,2,C21+1))","v":0},{"$f":"IF(F21=0,0,INDEX('Project Description'!C788:G788,1,'Unit Mix and Rents'!C21+1))","v":0},{"$f":"IF(F21=0,0,INDEX(AE44:AI44,1,'Unit Mix and Rents'!C21+1))","v":0},{"$f":"IF(F21=0,0,INDEX(AE44:AI45,2,'Unit Mix and Rents'!C21+1))","v":0},null,"","","","",{"$f":"IF(J21<>\"Yes\",\"\",IF(AND(OR(C21=0,C21=1),K21=Controls!A144),\"\",5))","v":""},"","",null,0,0,0,0,0]
[13,"",null,null,null,null,null,null,null,null,null,null,"",null,0,0,{"$f":"IF(K22=\"\",\"\",MATCH(K22,Controls!A143:A151,0))","v":""},0,0,0,{"$f":"IF(AND(T22=0,OR(K22=Controls!A144,K22=Controls!A145)),F22,0)","v":0},0,0,0,0,0,null,0,0,0,{"$f":"IF(K22=\"\",\"\",VLOOKUP(K22,'Project Description'!B772:G779,'Unit Mix and Rents'!AF22,FALSE))","v":""},2,"",{"$f":"IF(F22=0,0,INDEX('Project Description'!C796:G797,2,C22+1))","v":0},{"$f":"IF(F22=0,0,INDEX('Project Description'!C788:G788,1,'Unit Mix and Rents'!C22+1))","v":0},{"$f":"IF(F22=0,0,INDEX(AE44:AI44,1,'Unit Mix and Rents'!C22+1))","v":0},{"$f":"IF(F22=0,0,INDEX(AE44:AI45,2,'Unit Mix and Rents'!C22+1))","v":0},null,"","","","",{"$f":"IF(J22<>\"Yes\",\"\",IF(AND(OR(C22=0,C22=1),K22=Controls!A144),\"\",5))","v":""},"","",null,0,0,0,0,0]
[14,"",null,null,null,null,null,null,null,null,null,null,"",null,0,0,{"$f":"IF(K23=\"\",\"\",MATCH(K23,Controls!A143:A151,0))","v":""},0,0,0,{"$f":"IF(AND(T23=0,OR(K23=Controls!A144,K23=Controls!A145)),F23,0)","v":0},0,0,0,0,0,null,0,0,0,{"$f":"IF(K23=\"\",\"\",VLOOKUP(K23,'Project Description'!B772:G779,'Unit Mix and Rents'!AF23,FALSE))","v":""},2,"",{"$f":"IF(F23=0,0,INDEX('Project Description'!C796:G797,2,C23+1))","v":0},{"$f":"IF(F23=0,0,INDEX('Project Description'!C788:G788,1,'Unit Mix and Rents'!C23+1))","v":0},{"$f":"IF(F23=0,0,INDEX(AE44:AI44,1,'Unit Mix and Rents'!C23+1))","v":0},{"$f":"IF(F23=0,0,INDEX(AE44:AI45,2,'Unit Mix and Rents'!C23+1))","v":0},null,"","","","",{"$f":"IF(J23<>\"Yes\",\"\",IF(AND(OR(C23=0,C23=1),K23=Controls!A144),\"\",5))","v":""},"","",null,0,0,0,0,0]
[15,"",null,null,null,null,null,null,null,null,null,null,"",null,0,0,{"$f":"IF(K24=\"\",\"\",MATCH(K24,Controls!A143:A151,0))","v":""},0,0,0,{"$f":"IF(AND(T24=0,OR(K24=Controls!A144,K24=Controls!A145)),F24,0)","v":0},0,0,0,0,0,null,0,0,0,{"$f":"IF(K24=\"\",\"\",VLOOKUP(K24,'Project Description'!B772:G779,'Unit Mix and Rents'!AF24,FALSE))","v":""},2,"",{"$f":"IF(F24=0,0,INDEX('Project Description'!C796:G797,2,C24+1))","v":0},{"$f":"IF(F24=0,0,INDEX('Project Description'!C788:G788,1,'Unit Mix and Rents'!C24+1))","v":0},{"$f":"IF(F24=0,0,INDEX(AE44:AI44,1,'Unit Mix and Rents'!C24+1))","v":0},{"$f":"IF(F24=0,0,INDEX(AE44:AI45,2,'Unit Mix and Rents'!C24+1))","v":0},null,"","","","",{"$f":"IF(J24<>\"Yes\",\"\",IF(AND(OR(C24=0,C24=1),K24=Controls!A144),\"\",5))","v":""},"","",null,0,0,0,0,0]
[16,"",null,null,null,null,null,null,null,null,null,null,"",null,0,0,{"$f":"IF(K25=\"\",\"\",MATCH(K25,Controls!A143:A151,0))","v":""},0,0,0,{"$f":"IF(AND(T25=0,OR(K25=Controls!A144,K25=Controls!A145)),F25,0)","v":0},0,0,0,0,0,null,0,0,0,{"$f":"IF(K25=\"\",\"\",VLOOKUP(K25,'Project Description'!B772:G779,'Unit Mix and Rents'!AF25,FALSE))","v":""},2,"",{"$f":"IF(F25=0,0,INDEX('Project Description'!C796:G797,2,C25+1))","v":0},{"$f":"IF(F25=0,0,INDEX('Project Description'!C788:G788,1,'Unit Mix and Rents'!C25+1))","v":0},{"$f":"IF(F25=0,0,INDEX(AE44:AI44,1,'Unit Mix and Rents'!C25+1))","v":0},{"$f":"IF(F25=0,0,INDEX(AE44:AI45,2,'Unit Mix and Rents'!C25+1))","v":0},null,"","","","",{"$f":"IF(J25<>\"Yes\",\"\",IF(AND(OR(C25=0,C25=1),K25=Controls!A144),\"\",5))","v":""},"","",null,0,0,0,0,0]
[17,"",null,null,null,null,null,null,null,null,null,null,"",null,0,0,{"$f":"IF(K26=\"\",\"\",MATCH(K26,Controls!A143:A151,0))","v":""},0,0,0,{"$f":"IF(AND(T26=0,OR(K26=Controls!A144,K26=Controls!A145)),F26,0)","v":0},0,0,0,0,0,null,0,0,0,{"$f":"IF(K26=\"\",\"\",VLOOKUP(K26,'Project Description'!B772:G779,'Unit Mix and Rents'!AF26,FALSE))","v":""},2,"",{"$f":"IF(F26=0,0,INDEX('Project Description'!C796:G797,2,C26+1))","v":0},{"$f":"IF(F26=0,0,INDEX('Project Description'!C788:G788,1,'Unit Mix and Rents'!C26+1))","v":0},{"$f":"IF(F26=0,0,INDEX(AE44:AI44,1,'Unit Mix and Rents'!C26+1))","v":0},{"$f":"IF(F26=0,0,INDEX(AE44:AI45,2,'Unit Mix and Rents'!C26+1))","v":0},null,"","","","",{"$f":"IF(J26<>\"Yes\",\"\",IF(AND(OR(C26=0,C26=1),K26=Controls!A144),\"\",5))","v":""},"","",null,0,0,0,0,0]
[18,"",null,null,null,null,null,null,null,null,null,null,"",null,0,0,{"$f":"IF(K27=\"\",\"\",MATCH(K27,Controls!A143:A151,0))","v":""},0,0,0,{"$f":"IF(AND(T27=0,OR(K27=Controls!A144,K27=Controls!A145)),F27,0)","v":0},0,0,0,0,0,null,0,0,0,{"$f":"IF(K27=\"\",\"\",VLOOKUP(K27,'Project Description'!B772:G779,'Unit Mix and Rents'!AF27,FALSE))","v":""},2,"",{"$f":"IF(F27=0,0,INDEX('Project Description'!C796:G797,2,C27+1))","v":0},{"$f":"IF(F27=0,0,INDEX('Project Description'!C788:G788,1,'Unit Mix and Rents'!C27+1))","v":0},{"$f":"IF(F27=0,0,INDEX(AE44:AI44,1,'Unit Mix and Rents'!C27+1))","v":0},{"$f":"IF(F27=0,0,INDEX(AE44:AI45,2,'Unit Mix and Rents'!C27+1))","v":0},null,"","","","",{"$f":"IF(J27<>\"Yes\",\"\",IF(AND(OR(C27=0,C27=1),K27=Controls!A144),\"\",5))","v":""},"","",null,0,0,0,0,0]
[19,"",null,null,null,null,null,null,null,null,null,null,"",null,0,0,{"$f":"IF(K28=\"\",\"\",MATCH(K28,Controls!A143:A151,0))","v":""},0,0,0,{"$f":"IF(AND(T28=0,OR(K28=Controls!A144,K28=Controls!A145)),F28,0)","v":0},0,0,0,0,0,null,0,0,0,{"$f":"IF(K28=\"\",\"\",VLOOKUP(K28,'Project Description'!B772:G779,'Unit Mix and Rents'!AF28,FALSE))","v":""},2,"",{"$f":"IF(F28=0,0,INDEX('Project Description'!C796:G797,2,C28+1))","v":0},{"$f":"IF(F28=0,0,INDEX('Project Description'!C788:G788,1,'Unit Mix and Rents'!C28+1))","v":0},{"$f":"IF(F28=0,0,INDEX(AE44:AI44,1,'Unit Mix and Rents'!C28+1))","v":0},{"$f":"IF(F28=0,0,INDEX(AE44:AI45,2,'Unit Mix and Rents'!C28+1))","v":0},null,"","","","",{"$f":"IF(J28<>\"Yes\",\"\",IF(AND(OR(C28=0,C28=1),K28=Controls!A144),\"\",5))","v":""},"","",null,0,0,0,0,0]
[20,"",null,null,null,null,null,null,null,null,null,null,"",null,0,0,{"$f":"IF(K29=\"\",\"\",MATCH(K29,Controls!A143:A151,0))","v":""},0,0,0,{"$f":"IF(AND(T29=0,OR(K29=Controls!A144,K29=Controls!A145)),F29,0)","v":0},0,0,0,0,0,null,0,0,0,{"$f":"IF(K29=\"\",\"\",VLOOKUP(K29,'Project Description'!B772:G779,'Unit Mix and Rents'!AF29,FALSE))","v":""},2,"",{"$f":"IF(F29=0,0,INDEX('Project Description'!C796:G797,2,C29+1))","v":0},{"$f":"IF(F29=0,0,INDEX('Project Description'!C788:G788,1,'Unit Mix and Rents'!C29+1))","v":0},{"$f":"IF(F29=0,0,INDEX(AE44:AI44,1,'Unit Mix and Rents'!C29+1))","v":0},{"$f":"IF(F29=0,0,INDEX(AE44:AI45,2,'Unit Mix and Rents'!C29+1))","v":0},null,"","","","",{"$f":"IF(J29<>\"Yes\",\"\",IF(AND(OR(C29=0,C29=1),K29=Controls!A144),\"\",5))","v":""},"","",null,0,0,0,0,0]
[21,"",null,null,null,null,null,null,null,null,null,null,"",null,0,0,{"$f":"IF(K30=\"\",\"\",MATCH(K30,Controls!A143:A151,0))","v":""},0,0,0,{"$f":"IF(AND(T30=0,OR(K30=Controls!A144,K30=Controls!A145)),F30,0)","v":0},0,0,0,0,0,null,0,0,0,{"$f":"IF(K30=\"\",\"\",VLOOKUP(K30,'Project Description'!B772:G779,'Unit Mix and Rents'!AF30,FALSE))","v":""},2,"",{"$f":"IF(F30=0,0,INDEX('Project Description'!C796:G797,2,C30+1))","v":0},{"$f":"IF(F30=0,0,INDEX('Project Description'!C788:G788,1,'Unit Mix and Rents'!C30+1))","v":0},{"$f":"IF(F30=0,0,INDEX(AE44:AI44,1,'Unit Mix and Rents'!C30+1))","v":0},{"$f":"IF(F30=0,0,INDEX(AE44:AI45,2,'Unit Mix and Rents'!C30+1))","v":0},null,"","","","",{"$f":"IF(J30<>\"Yes\",\"\",IF(AND(OR(C30=0,C30=1),K30=Controls!A144),\"\",5))","v":""},"","",null,0,0,0,0,0]
[22,"",null,null,null,null,null,null,null,null,null,null,"",null,0,0,{"$f":"IF(K31=\"\",\"\",MATCH(K31,Controls!A143:A151,0))","v":""},0,0,0,{"$f":"IF(AND(T31=0,OR(K31=Controls!A144,K31=Controls!A145)),F31,0)","v":0},0,0,0,0,0,null,0,0,0,{"$f":"IF(K31=\"\",\"\",VLOOKUP(K31,'Project Description'!B772:G779,'Unit Mix and Rents'!AF31,FALSE))","v":""},2,"",{"$f":"IF(F31=0,0,INDEX('Project Description'!C796:G797,2,C31+1))","v":0},{"$f":"IF(F31=0,0,INDEX('Project Description'!C788:G788,1,'Unit Mix and Rents'!C31+1))","v":0},{"$f":"IF(F31=0,0,INDEX(AE44:AI44,1,'Unit Mix and Rents'!C31+1))","v":0},{"$f":"IF(F31=0,0,INDEX(AE44:AI45,2,'Unit Mix and Rents'!C31+1))","v":0},null,"","","","",{"$f":"IF(J31<>\"Yes\",\"\",IF(AND(OR(C31=0,C31=1),K31=Controls!A144),\"\",5))","v":""},"","",null,0,0,0,0,0]
[23,"",null,null,null,null,null,null,null,null,null,null,"",null,0,0,{"$f":"IF(K32=\"\",\"\",MATCH(K32,Controls!A143:A151,0))","v":""},0,0,0,{"$f":"IF(AND(T32=0,OR(K32=Controls!A144,K32=Controls!A145)),F32,0)","v":0},0,0,0,0,0,null,0,0,0,{"$f":"IF(K32=\"\",\"\",VLOOKUP(K32,'Project Description'!B772:G779,'Unit Mix and Rents'!AF32,FALSE))","v":""},2,"",{"$f":"IF(F32=0,0,INDEX('Project Description'!C796:G797,2,C32+1))","v":0},{"$f":"IF(F32=0,0,INDEX('Project Description'!C788:G788,1,'Unit Mix and Rents'!C32+1))","v":0},{"$f":"IF(F32=0,0,INDEX(AE44:AI44,1,'Unit Mix and Rents'!C32+1))","v":0},{"$f":"IF(F32=0,0,INDEX(AE44:AI45,2,'Unit Mix and Rents'!C32+1))","v":0},null,"","","","",{"$f":"IF(J32<>\"Yes\",\"\",IF(AND(OR(C32=0,C32=1),K32=Controls!A144),\"\",5))","v":""},"","",null,0,0,0,0,0]
[24,"",null,null,null,null,null,null,null,null,null,null,"",null,{"$f":"IF(G33=\"Yes\",F33,0)","v":0},0,{"$f":"IF(K33=\"\",\"\",MATCH(K33,Controls!A143:A151,0))","v":""},0,0,{"$f":"IF(J33=\"Yes\",F33,0)","v":0},{"$f":"IF(AND(T33=0,OR(K33=Controls!A144,K33=Controls!A145)),F33,0)","v":0},0,0,0,0,0,null,{"$f":"IF(G33=\"Yes\",F33*E33,0)","v":0},0,{"$f":"IF(I33=\"Yes\",F33,0)","v":0},{"$f":"IF(K33=\"\",\"\",VLOOKUP(K33,'Project Description'!B772:G779,'Unit Mix and Rents'!AF33,FALSE))","v":""},{"$f":"+C33+2","v":2},{"$f":"IF(ISNA(AE33),9999,AE33)","v":""},{"$f":"IF(F33=0,0,INDEX('Project Description'!C796:G797,2,C33+1))","v":0},{"$f":"IF(F33=0,0,INDEX('Project Description'!C788:G788,1,'Unit Mix and Rents'!C33+1))","v":0},{"$f":"IF(F33=0,0,INDEX(AE44:AI44,1,'Unit Mix and Rents'!C33+1))","v":0},{"$f":"IF(F33=0,0,INDEX(AE44:AI45,2,'Unit Mix and Rents'!C33+1))","v":0},null,{"$f":"IF(L33>AG33,1,\"\")","v":""},{"$f":"IF(L33>AI33,2,\"\")","v":""},{"$f":"IF(E33<AJ33,3,\"\")","v":""},{"$f":"IF(D33<AK33,4,\"\")","v":""},{"$f":"IF(J33<>\"Yes\",\"\",IF(AND(OR(C33=0,C33=1),K33=Controls!A144),\"\",5))","v":""},{"$f":"IF(L33>AH33,6,\"\")","v":""},"",null,0,0,0,0,0]
[25,"",null,null,null,null,null,null,null,null,null,null,"",null,0,0,{"$f":"IF(K34=\"\",\"\",MATCH(K34,Controls!A143:A151,0))","v":""},0,0,0,{"$f":"IF(AND(T34=0,OR(K34=Controls!A144,K34=Controls!A145)),F34,0)","v":0},0,0,0,0,0,null,0,0,0,{"$f":"IF(K34=\"\",\"\",VLOOKUP(K34,'Project Description'!B772:G779,'Unit Mix and Rents'!AF34,FALSE))","v":""},2,"",{"$f":"IF(F34=0,0,INDEX('Project Description'!C796:G797,2,C34+1))","v":0},{"$f":"IF(F34=0,0,INDEX('Project Description'!C788:G788,1,'Unit Mix and Rents'!C34+1))","v":0},{"$f":"IF(F34=0,0,INDEX(AE44:AI44,1,'Unit Mix and Rents'!C34+1))","v":0},{"$f":"IF(F34=0,0,INDEX(AE44:AI45,2,'Unit Mix and Rents'!C34+1))","v":0},null,"","","","",{"$f":"IF(J34<>\"Yes\",\"\",IF(AND(OR(C34=0,C34=1),K34=Controls!A144),\"\",5))","v":""},"","",null,0,0,0,0,0]
[26,"",null,null,null,null,null,null,null,null,null,null,"",null,0,0,{"$f":"IF(K35=\"\",\"\",MATCH(K35,Controls!A143:A151,0))","v":""},0,0,0,{"$f":"IF(AND(T35=0,OR(K35=Controls!A144,K35=Controls!A145)),F35,0)","v":0},0,0,0,0,0,null,0,0,0,{"$f":"IF(K35=\"\",\"\",VLOOKUP(K35,'Project Description'!B772:G779,'Unit Mix and Rents'!AF35,FALSE))","v":""},2,"",{"$f":"IF(F35=0,0,INDEX('Project Description'!C796:G797,2,C35+1))","v":0},{"$f":"IF(F35=0,0,INDEX('Project Description'!C788:G788,1,'Unit Mix and Rents'!C35+1))","v":0},{"$f":"IF(F35=0,0,INDEX(AE44:AI44,1,'Unit Mix and Rents'!C35+1))","v":0},{"$f":"IF(F35=0,0,INDEX(AE44:AI45,2,'Unit Mix and Rents'!C35+1))","v":0},null,"","","","",{"$f":"IF(J35<>\"Yes\",\"\",IF(AND(OR(C35=0,C35=1),K35=Controls!A144),\"\",5))","v":""},"","",null,0,0,0,0,0]
[27,"",null,null,null,null,null,null,null,null,null,null,"",null,0,0,{"$f":"IF(K36=\"\",\"\",MATCH(K36,Controls!A143:A151,0))","v":""},0,0,0,{"$f":"IF(AND(T36=0,OR(K36=Controls!A144,K36=Controls!A145)),F36,0)","v":0},0,0,0,0,0,null,0,0,0,{"$f":"IF(K36=\"\",\"\",VLOOKUP(K36,'Project Description'!B772:G779,'Unit Mix and Rents'!AF36,FALSE))","v":""},2,"",{"$f":"IF(F36=0,0,INDEX('Project Description'!C796:G797,2,C36+1))","v":0},{"$f":"IF(F36=0,0,INDEX('Project Description'!C788:G788,1,'Unit Mix and Rents'!C36+1))","v":0},{"$f":"IF(F36=0,0,INDEX(AE44:AI44,1,'Unit Mix and Rents'!C36+1))","v":0},{"$f":"IF(F36=0,0,INDEX(AE44:AI45,2,'Unit Mix and Rents'!C36+1))","v":0},null,"","","","",{"$f":"IF(J36<>\"Yes\",\"\",IF(AND(OR(C36=0,C36=1),K36=Controls!A144),\"\",5))","v":""},"","",null,0,0,0,0,0]
[28,"",null,null,null,null,null,null,null,null,null,null,"",null,0,0,{"$f":"IF(K37=\"\",\"\",MATCH(K37,Controls!A143:A151,0))","v":""},0,0,0,{"$f":"IF(AND(T37=0,OR(K37=Controls!A144,K37=Controls!A145)),F37,0)","v":0},0,0,0,0,0,null,0,0,0,{"$f":"IF(K37=\"\",\"\",VLOOKUP(K37,'Project Description'!B772:G779,'Unit Mix and Rents'!AF37,FALSE))","v":""},2,"",{"$f":"IF(F37=0,0,INDEX('Project Description'!C796:G797,2,C37+1))","v":0},{"$f":"IF(F37=0,0,INDEX('Project Description'!C788:G788,1,'Unit Mix and Rents'!C37+1))","v":0},{"$f":"IF(F37=0,0,INDEX(AE44:AI44,1,'Unit Mix and Rents'!C37+1))","v":0},{"$f":"IF(F37=0,0,INDEX(AE44:AI45,2,'Unit Mix and Rents'!C37+1))","v":0},null,"","","","",{"$f":"IF(J37<>\"Yes\",\"\",IF(AND(OR(C37=0,C37=1),K37=Controls!A144),\"\",5))","v":""},"","",null,0,0,0,0,0]
[29,"",null,null,null,null,null,null,null,null,null,null,"",null,0,0,{"$f":"IF(K38=\"\",\"\",MATCH(K38,Controls!A143:A151,0))","v":""},0,0,0,{"$f":"IF(AND(T38=0,OR(K38=Controls!A144,K38=Controls!A145)),F38,0)","v":0},0,0,0,0,0,null,0,0,0,{"$f":"IF(K38=\"\",\"\",VLOOKUP(K38,'Project Description'!B772:G779,'Unit Mix and Rents'!AF38,FALSE))","v":""},2,"",{"$f":"IF(F38=0,0,INDEX('Project Description'!C796:G797,2,C38+1))","v":0},{"$f":"IF(F38=0,0,INDEX('Project Description'!C788:G788,1,'Unit Mix and Rents'!C38+1))","v":0},{"$f":"IF(F38=0,0,INDEX(AE44:AI44,1,'Unit Mix and Rents'!C38+1))","v":0},{"$f":"IF(F38=0,0,INDEX(AE44:AI45,2,'Unit Mix and Rents'!C38+1))","v":0},null,"","","","",{"$f":"IF(J38<>\"Yes\",\"\",IF(AND(OR(C38=0,C38=1),K38=Controls!A144),\"\",5))","v":""},"","",null,0,0,0,0,0]
[30,"",null,null,null,null,null,null,null,null,null,null,"",null,0,0,{"$f":"IF(K39=\"\",\"\",MATCH(K39,Controls!A143:A151,0))","v":""},0,0,0,{"$f":"IF(AND(T39=0,OR(K39=Controls!A144,K39=Controls!A145)),F39,0)","v":0},0,0,0,0,0,null,0,0,0,{"$f":"IF(K39=\"\",\"\",VLOOKUP(K39,'Project Description'!B772:G779,'Unit Mix and Rents'!AF39,FALSE))","v":""},2,"",{"$f":"IF(F39=0,0,INDEX('Project Description'!C796:G797,2,C39+1))","v":0},{"$f":"IF(F39=0,0,INDEX('Project Description'!C788:G788,1,'Unit Mix and Rents'!C39+1))","v":0},{"$f":"IF(F39=0,0,INDEX(AE44:AI44,1,'Unit Mix and Rents'!C39+1))","v":0},{"$f":"IF(F39=0,0,INDEX(AE44:AI45,2,'Unit Mix and Rents'!C39+1))","v":0},null,"","","","",{"$f":"IF(J39<>\"Yes\",\"\",IF(AND(OR(C39=0,C39=1),K39=Controls!A144),\"\",5))","v":""},"","",null,0,0,0,0,0]
[]
[null,"Totals",null,null,{"$f":"SUMPRODUCT(F9:F40,E9:E40)","v":0},{"$f":"SUM(F9:F40)","v":0},{"$f":"SUM(O9:O40)","v":0},{"$f":"SUM(P9:P40)","v":0},{"$f":"SUM(AD9:AD40)","v":0},null,null,{"$f":"SUMPRODUCT(F9:F40,L9:L40)","v":0},null,null,{"$f":"SUM(O9:O40)","v":0},0,null,0,0,0,0,0,0,0,0,0,null,{"$f":"SUM(AB9:AB40)","v":0},{"$f":"SUM(AC9:AC40)","v":0},null,null,null,null,null,null,null,null,null,{"$f":"COUNTIF(AM9:AM40,\">0\")","v":0},0,0,0,0,0,0,null,{"$f":"SUM(AU9:AU40)","v":0},{"$f":"SUM(AV9:AV40)","v":0},{"$f":"SUM(AW9:AW40)","v":0},{"$f":"SUM(AX9:AX40)","v":0},{"$f":"SUM(AY9:AY40)","v":0}]
[null,null,null,null,null,null,null,null,null,null,null,null,null,null,null,null,null,null,null,null,null,null,null,null,{"$f":"IF(O41=0,0,+Y41/O41)","v":0}]
[null,"% of Rental Subsidy Units in the project:",null,null,null,null,{"$f":"IF(F41=0,0,+I41/F41)","v":0},null,null,null,null,null,null,null,null,null,null,null,null,null,null,null,null,null,null,null,null,null,null,null,"0BR","1BR","2BR","3BR","4BR",null,null,null,{"$f":"SUM(AM41:AT41)","v":0},"total flags",null,null,null,null,null,null,{"$f":"SUM(AU41:AY41)","v":0},"total units"]
[null,"% of Low-Income Units in the project:",null,null,null,{"$f":"+R41","v":0},{"$f":"IF(F41=0,0,+R41/F41)","v":0},null,{"$f":"IF(G44>=40%,\"Meets 40/60 Setaside\",\"Does not Meet 40/60 Setaside\")","v":"Does not Meet 40/60 Setaside"},null,null,null,null,null,"Minimum Sqft",null,null,null,null,null,null,null,null,null,null,null,null,null,null,null,450,650,800,1100,1400]
[null,"Total square feet for LIHTC units:",null,null,{"$f":"+AB41","v":0},null,null,null,null,null,null,null,null,null,"Minimum # Baths",null,null,null,null,null,null,null,null,null,null,null,null,null,null,null,1,1,1,2,2.5]
[null,"PSH Units:",null,null,null,{"$f":"+T41","v":0},{"$f":"IF(F41=0,0,+F46/F41)","v":0}]
[null,"Non-PSH Units Under 30% AMI:",null,null,null,{"$f":"+U41","v":0},{"$f":"IF(F41=0,0,+F47/F41)","v":0},null,null,null,null,null,null,null,{"$f":"+'Project Description'!H212","v":"Missing"},null," is user's Set-Aside Election"]
[null,"Units under 30% AMI:",null,null,null,{"$f":"+F46+F47","v":0},{"$f":"IF(F41=0,0,+F48/F41)","v":0}]
[null,"Units under 20% AMI:",null,null,null,{"$f":"+V41","v":0},{"$f":"IF(F41=0,0,+F49/F41)","v":0},null,null,null,null,null,null,null,{"$f":"IF(O47=\"40/60\",IF(G44>=40%,\"\",\"Error: Applicant's 40/60 Set-Aside Is Not Met\"),IF(O47=\"20/50\",IF(G50>=20%,\"\",\"Error: Applicant's 20/50 Set-Aside is not Met\"),\"\"))","v":""}]
[null,"Units under 50% AMI:",null,null,null,{"$f":"+S41","v":0},{"$f":"IF(F41=0,0,+F50/F41)","v":0},null,{"$f":"IF(G50>=20%,\"Meets 20/50 Setaside\",\"Does not Meet 20/50 Setaside\")","v":"Does not Meet 20/50 Setaside"}]
[null,"Units between 31% and 50% AMI:",null,null,null,{"$f":"+F50-F48","v":0},{"$f":"IF(F41=0,0,+F51/F41)","v":0}]
[null,"Units under 80% AMI:",null,null,null,{"$f":"+W41","v":0},{"$f":"IF(F41=0,0,+F52/F41)","v":0}]
[null,"Units Not AMI Restricted",null,null,null,{"$f":"+X41","v":0},{"$f":"IF(F41=0,0,+F53/F41)","v":0}]
[null,"LIHTC 'Income Average'",null,null,null,null,{"$f":"+Y42","v":0},null,"(weighted average of income limits for LIHTC units)"]
[null,"Staff Units",null,null,{"$f":"+AC41","v":0},{"$f":"+H41","v":0},{"$f":"IF(F41=0,0,+F55/F41)","v":0}]
[null,"Residential Units",null,null,{"$f":"+E41-E55","v":0},{"$f":"+F41-F55","v":0},{"$f":"IF(F41=0,0,+F56/F41)","v":0}]
[]
[null,{"$f":"IF(G48>=5%,\"\",TEXT(O54,\"0.0%\")&\" of units are affordable at or below 30% AMI; QAP requires at least 5%\")","v":"0.0% of units are affordable at or below 30% AMI; QAP requires at least 5%"}]
[]
[{"$f":"\"The applicant selected the following set-aside option: \"&'Project Description'!H212","v":"The applicant selected the following set-aside option: Missing"}]
[]
["* Rent is after subtracting the utility allowance; that is, this is the rent the project will collect."]
["** Note 1 indicates that the proposed rent is higher than the applicable AMI limit.  \nNote 2 indicates that the proposed rent is higher than the estimated market rent for this unit type. \nNote 3 indicates that the square footage is below the LHC minimum for this unit type. \nNote 4 indicates that the number of baths is below the LHC minimum for this unit type. \nNote 5 indicates that units designated as PSH are either (a) larger than 1 BR or (b) not restricted at 20% AMI.\nNote 6 indicates that the proposed rent is higher than the FMR for this unit type.\nNote 7 indicates a potential problem with a Staff Unit; the Application expects to see LIHTC = No, PSH = No, AMI Restriction = Not Restricted, and Rent = zero. The values you entered may, however, be correct; if so, provide an explanation in your Checklist response.\nIf any Note is indicated (in column M) for any unit type, the Checklist worksheet will include a question. "]
[null,null,0,1,2,3,4]
[null,"Unit Mix Summary","0 BR","1 BR","2 BR","3 BR","4 BR",null,"Total"]
[null,{"$f":"+Controls!A144","v":"20% AMI"},{"$f":"SUMIFS(F9:F40,K9:K40,B66,C9:C40,C64)","v":0},{"$f":"SUMIFS(F9:F40,K9:K40,B66,C9:C40,D64)","v":0},{"$f":"SUMIFS(F9:F40,K9:K40,B66,C9:C40,E64)","v":0},{"$f":"SUMIFS(F9:F40,K9:K40,B66,C9:C40,F64)","v":0},{"$f":"SUMIFS(F9:F40,K9:K40,B66,C9:C40,G64)","v":0},null,{"$f":"SUM(C66:G66)","v":0}]
[null,{"$f":"+Controls!A145","v":"30% AMI"},{"$f":"SUMIFS(F9:F40,K9:K40,B67,C9:C40,C64)","v":0},{"$f":"SUMIFS(F9:F40,K9:K40,B67,C9:C40,D64)","v":0},{"$f":"SUMIFS(F9:F40,K9:K40,B67,C9:C40,E64)","v":0},{"$f":"SUMIFS(F9:F40,K9:K40,B67,C9:C40,F64)","v":0},{"$f":"SUMIFS(F9:F40,K9:K40,B67,C9:C40,G64)","v":0},null,0]
[null,{"$f":"+Controls!A146","v":"40% AMI"},{"$f":"SUMIFS(F9:F40,K9:K40,B68,C9:C40,C64)","v":0},{"$f":"SUMIFS(F9:F40,K9:K40,B68,C9:C40,D64)","v":0},{"$f":"SUMIFS(F9:F40,K9:K40,B68,C9:C40,E64)","v":0},{"$f":"SUMIFS(F9:F40,K9:K40,B68,C9:C40,F64)","v":0},{"$f":"SUMIFS(F9:F40,K9:K40,B68,C9:C40,G64)","v":0},null,0]
[null,{"$f":"+Controls!A147","v":"50% AMI"},{"$f":"SUMIFS(F9:F40,K9:K40,B69,C9:C40,C64)","v":0},{"$f":"SUMIFS(F9:F40,K9:K40,B69,C9:C40,D64)","v":0},{"$f":"SUMIFS(F9:F40,K9:K40,B69,C9:C40,E64)","v":0},{"$f":"SUMIFS(F9:F40,K9:K40,B69,C9:C40,F64)","v":0},{"$f":"SUMIFS(F9:F40,K9:K40,B69,C9:C40,G64)","v":0},null,0]
[null,{"$f":"+Controls!A148","v":"60% AMI"},{"$f":"SUMIFS(F9:F40,K9:K40,B70,C9:C40,C64)","v":0},{"$f":"SUMIFS(F9:F40,K9:K40,B70,C9:C40,D64)","v":0},{"$f":"SUMIFS(F9:F40,K9:K40,B70,C9:C40,E64)","v":0},{"$f":"SUMIFS(F9:F40,K9:K40,B70,C9:C40,F64)","v":0},{"$f":"SUMIFS(F9:F40,K9:K40,B70,C9:C40,G64)","v":0},null,0]
[null,{"$f":"+Controls!A149","v":"70% AMI"},{"$f":"SUMIFS(F9:F40,K9:K40,B71,C9:C40,C64)","v":0},{"$f":"SUMIFS(F9:F40,K9:K40,B71,C9:C40,D64)","v":0},{"$f":"SUMIFS(F9:F40,K9:K40,B71,C9:C40,E64)","v":0},{"$f":"SUMIFS(F9:F40,K9:K40,B71,C9:C40,F64)","v":0},{"$f":"SUMIFS(F9:F40,K9:K40,B71,C9:C40,G64)","v":0},null,0]
[null,{"$f":"+Controls!A150","v":"80% AMI"},{"$f":"SUMIFS(F9:F40,K9:K40,B72,C9:C40,C64)","v":0},{"$f":"SUMIFS(F9:F40,K9:K40,B72,C9:C40,D64)","v":0},{"$f":"SUMIFS(F9:F40,K9:K40,B72,C9:C40,E64)","v":0},{"$f":"SUMIFS(F9:F40,K9:K40,B72,C9:C40,F64)","v":0},{"$f":"SUMIFS(F9:F40,K9:K40,B72,C9:C40,G64)","v":0},null,0]
[null,{"$f":"+Controls!A143","v":"120% AMI"},{"$f":"SUMIFS(F9:F40,K9:K40,B73,C9:C40,C64)","v":0},{"$f":"SUMIFS(F9:F40,K9:K40,B73,C9:C40,D64)","v":0},{"$f":"SUMIFS(F9:F40,K9:K40,B73,C9:C40,E64)","v":0},{"$f":"SUMIFS(F9:F40,K9:K40,B73,C9:C40,F64)","v":0},{"$f":"SUMIFS(F9:F40,K9:K40,B73,C9:C40,G64)","v":0},null,0]
[null,{"$f":"+Controls!A151","v":"Not AMI Restricted"},{"$f":"SUMIFS(F9:F40,K9:K40,B74,C9:C40,C64)","v":0},{"$f":"SUMIFS(F9:F40,K9:K40,B74,C9:C40,D64)","v":0},{"$f":"SUMIFS(F9:F40,K9:K40,B74,C9:C40,E64)","v":0},{"$f":"SUMIFS(F9:F40,K9:K40,B74,C9:C40,F64)","v":0},{"$f":"SUMIFS(F9:F40,K9:K40,B74,C9:C40,G64)","v":0},null,0]
[null,"Total Units",{"$f":"+AU41","v":0},{"$f":"+AV41","v":0},{"$f":"+AW41","v":0},{"$f":"+AX41","v":0},{"$f":"+AY41","v":0},null,{"$f":"+AU43","v":0}]
[]
[null,"PSH Units",{"$f":"SUMIFS(F9:F40,J9:J40,\"Yes\",C9:C40,C64)","v":0},{"$f":"SUMIFS(F9:F40,J9:J40,\"Yes\",C9:C40,D64)","v":0},{"$f":"SUMIFS(F9:F40,J9:J40,\"Yes\",C9:C40,E64)","v":0},{"$f":"SUMIFS(F9:F40,J9:J40,\"Yes\",C9:C40,F64)","v":0},{"$f":"SUMIFS(F9:F40,J9:J40,\"Yes\",C9:C40,G64)","v":0},null,{"$f":"SUM(C77:G77)","v":0}]

{"sheet":"Development Costs","index":9,"n_rows":396,"n_cols":14,"rows_kept":396,"cut":false,"hidden":false,"merged":[[233,10,233,13],[368,1,368,4],[378,1,378,4],[379,1,379,4],[380,1,380,4],[255,1,255,5],[256,1,256,5],[255,9,255,13],[256,9,256,13],[262,1,262,5],[374,1,374,5],[384,1,384,4],[381,1,381,4],[169,1,169,4],[143,1,143,5],[165,1,165,5],[194,1,194,5],[258,1,258,5],[370,1,370,5],[375,1,375,5],[304,3,304,6],[3,0,3,6],[9,1,9,3],[382,1,382,4],[383,1,383,4],[141,1,141,4]]}
[]
[]
[{"$f":"+Instructions!A3","v":"2025 QAP Underwriting Application v1.1"}]
[{"$f":"TRIM('Project Description'!E84)&\" (\"&TRIM('Project Description'!E86)&\" LA), \"&'Project Description'!E50","v":" ( LA), "}]
[]
["Development Costs",null,null,null,null,null,null,null,{"$f":"+'Project Description'!L1071","v":35}]
[]
[{"$f":"\"Section \"&I8","v":"Section 36"},"Detail of Development Costs",null,null,null,null,"QAP Reference",null,{"$f":"+I6+1","v":36}]
[]
[null,{"$f":"\"Note -- see Section \"&I155&\" for calculation of acquisition (4%) basis and construction (9%) basis.\"","v":"Note -- see Section 38 for calculation of acquisition (4%) basis and construction (9%) basis."}]
[]
[null,"Acquisition",null,{"$f":"SUM(C13:C17)","v":0},null,null,null,null,null,null,"Exculded from the Developer Fee Calculation for projects with no tenant relocation offsite"]
[{"$f":"+I13","v":36.01},"Building Acquisition",0,null,null,null,null,null,{"$f":"+I8+0.01","v":36.01}]
[{"$f":"+I14","v":36.019999999999996},"Land Acquisition (value of donated land)",0,null,null,null,null,null,{"$f":"+I13+0.01","v":36.019999999999996}]
[{"$f":"+I15","v":36.029999999999994},"Land Acquisition (other)",0,null,null,null,null,null,{"$f":"+I14+0.01","v":36.029999999999994}]
[{"$f":"+I16","v":36.039999999999992},"Acquisition Fee",0,null,null,null,null,null,{"$f":"+I15+0.01","v":36.039999999999992}]
[]
[null,"Construction Contract: Building Costs",null,{"$f":"SUM(C19:C27)","v":0}]
[{"$f":"+I19","v":36.039999999999992},"Appliances",0,null,null,null,null,null,{"$f":"+I15+0.01","v":36.039999999999992}]
[36.04999999999999,"Community Facilities",{"$f":"+'Project Description'!H578","v":0},{"$f":"\"See Section \"&'Project Description'!A576","v":"See Section 20.06"},null,null,{"$f":"+'QAP Reference'!A71","v":"IV.D"},null,{"$f":"+I19+0.01","v":36.04999999999999}]
[36.059999999999988,"Community Service Facilities",{"$f":"+'Project Description'!H587","v":0},{"$f":"\"See Section \"&'Project Description'!A585","v":"See Section 20.07"},null,null,{"$f":"+'QAP Reference'!A71","v":"IV.D"},null,36.059999999999988]
[36.069999999999986,"Excess Costs",{"$f":"+'Project Description'!H597","v":0},{"$f":"\"See Section \"&'Project Description'!A593","v":"See Section 20.08"},null,null,null,null,36.069999999999986]
[36.079999999999984,"Residential Buildings - New Construction",0,null,null,null,null,null,36.079999999999984]
[36.089999999999982,"Residential Buildings - Rehabilitation",0,null,null,null,null,null,36.089999999999982]
[36.09999999999998,"Lead-based paint controls or abatement",0,null,null,null,null,null,{"$f":"+I24+0.01","v":36.09999999999998}]
[36.109999999999978,"Costs to Operate Self-Owned Equipment",{"$f":"+'Project Description'!H546","v":0},{"$f":"\"See Section \"&'Project Description'!A539","v":"See Section 20.01"},null,null,null,null,36.109999999999978]
[]
[null,"Construction Contract: Site Work",null,{"$f":"SUM(C29:C37)","v":0}]
[{"$f":"+I29","v":36.109999999999978},"Demolition Cost",0,null,null,null,null,null,{"$f":"+I25+0.01","v":36.109999999999978}]
[36.119999999999976,"Earth Work",0,null,null,null,null,null,{"$f":"+I29+0.01","v":36.119999999999976}]
[36.129999999999974,"Lawn/Plantings",0,null,null,null,null,null,{"$f":"+I30+0.01","v":36.129999999999974}]
[36.139999999999972,"Off Site Work",0,null,null,null,null,null,36.139999999999972]
[36.14999999999997,"Roads/Walks",0,null,null,null,null,null,36.14999999999997]
[36.159999999999968,"Site Utilities",0,null,null,null,null,null,36.159999999999968]
[36.169999999999966,"Unusual Site Conditions",null,null,null,null,null,null,36.169999999999966]
[36.179999999999964,"Extraordinary Site Costs",{"$f":"+'Project Description'!H574","v":0},{"$f":"\"See Section \"&'Project Description'!A573","v":"See Section 20.05"},null,null,null,null,36.179999999999964]
[]
[null,"Construction Contract: Other Costs",null,{"$f":"SUM(C39:C51)","v":0}]
[{"$f":"+I39","v":36.189999999999962},"Bond Premium Paid by Contractor",0,null,null,null,null,null,{"$f":"+I36+0.01","v":36.189999999999962}]
[36.19999999999996,"General Requirements",0,null,{"$f":"IF(J379>0,\"GR is \"&TEXT(J379,\"#,##0\")&\" above the limit\",\"\")","v":""},null,null,null,{"$f":"+I39+0.01","v":36.19999999999996}]
[36.209999999999958,"Costs to Lease Self-Owned Equipment",{"$f":"+'Project Description'!H544","v":0},{"$f":"\"See Section \"&'Project Description'!A539","v":"See Section 20.01"},null,null,null,null,36.209999999999958]
[36.219999999999956,"Builder's Overhead",0,null,{"$f":"IF(J380>0,\"BO is \"&TEXT(J380,\"#,##0\")&\" above the limit\",\"\")","v":""},null,null,null,36.219999999999956]
[36.229999999999954,"Builder's Profit",0,null,{"$f":"IF(J381>0,\"BP is \"&TEXT(J381,\"#,##0\")&\" above the limit\",\"\")","v":""},null,null,null,36.229999999999954]
[36.239999999999952,"Construction Manager's Fee",{"$f":"+'Project Description'!H557","v":0},{"$f":"\"See Section \"&'Project Description'!A556","v":"See Section 20.03"},null,null,null,null,36.239999999999952]
[36.24999999999995,"Builder's Risk Insurance",0,null,null,null,null,null,36.24999999999995]
[36.259999999999948,"Builder's Liability Insurance",0,null,null,null,null,null,36.259999999999948]
[36.269999999999946,"Worker's Compensation Insurance",0,null,null,null,null,null,36.269999999999946]
[36.279999999999944,"Other:  ",0,null,null,null,null,null,36.279999999999944]
[36.289999999999942,"Other:  ",0,null,null,null,null,null,36.289999999999942]
[36.29999999999994,"Other:  ",0,null,null,null,null,null,36.29999999999994]
[null,{"$f":"IF(J385>0,B385,\"\")","v":""}]
[null,"Hard Costs Outside Construction Contract",null,{"$f":"SUM(C55:C58)","v":0}]
[{"$f":"+I53","v":36.309999999999938},"Bond Premium Paid by Taxpayer",null,null,null,null,null,null,{"$f":"+I50+0.01","v":36.309999999999938}]
[]
[{"$f":"+I55","v":36.279999999999944},"Other Hard Cost (describe):",null,null,null,null,null,null,{"$f":"+I47+0.01","v":36.279999999999944}]
[{"$f":"+I56","v":36.289999999999942},"Other Hard Cost (describe):",null,null,null,null,null,null,{"$f":"+I55+0.01","v":36.289999999999942}]
[{"$f":"+I57","v":36.29999999999994},"Other Hard Cost (describe):",null,null,null,null,null,null,{"$f":"+I56+0.01","v":36.29999999999994}]
[]
[null,"Construction Contingency",null,{"$f":"+C60","v":0}]
[{"$f":"+I60","v":36.309999999999938},"Construction Hard Cost Contingency",0,null,{"$f":"IF(ROUND(C61,4)>10%,\"Contingency is above the 10% limit\",\"\")","v":""},null,null,null,{"$f":"+I57+0.01","v":36.309999999999938}]
[null,"Construction Hard Cost Contingency %",{"$f":"IF(C270=0,0,+C60/C270)","v":0}]
[]
[null,"Construction Interim Costs",null,{"$f":"SUM(C64:C76)","v":0}]
[{"$f":"+I64","v":36.319999999999936},"Bridge Loan Fees",0,null,null,null,null,null,{"$f":"+I60+0.01","v":36.319999999999936}]
[36.329999999999934,"Bridge Loan Legal Fees",0,null,null,null,null,null,{"$f":"+I64+0.01","v":36.329999999999934}]
[36.339999999999932,"Building Permits/Fees",0,null,null,null,null,null,36.339999999999932]
[36.34999999999993,"Construction Credit Enhancement",0,null,null,null,null,null,36.34999999999993]
[36.359999999999928,"Construction Financing Fees",0,null,null,null,null,null,36.359999999999928]
[36.369999999999926,"Construction Hazard Insurance",0,null,null,null,null,null,36.369999999999926]
[36.379999999999924,"Construction Interest",0,null,null,null,null,null,36.379999999999924]
[36.389999999999922,"Construction Legal Fees",0,null,null,null,null,null,36.389999999999922]
[36.39999999999992,"Construction Liability Insurance",0,null,null,null,null,null,36.39999999999992]
[36.409999999999918,"Construction Loan Points",0,null,null,null,null,null,36.409999999999918]
[36.419999999999916,"Construction Title and Recording",0,null,null,null,null,null,36.419999999999916]
[36.429999999999914,"Other Construction Finance Fees",0,null,null,null,null,null,36.429999999999914]
[]
[null,"Permanent Financing Costs",null,{"$f":"SUM(C78:C85)","v":0}]
[{"$f":"+I78","v":36.439999999999912},"Permanent Credit Enhancement",0,null,null,null,null,null,{"$f":"+I75+0.01","v":36.439999999999912}]
[36.44999999999991,"Permanent Financing Fees",0,null,null,null,null,null,{"$f":"+I78+0.01","v":36.44999999999991}]
[36.459999999999908,"Permanent Legal Fee",0,null,null,null,null,null,36.459999999999908]
[36.469999999999906,"Permanent Loan Points",0,null,null,null,null,null,36.469999999999906]
[36.479999999999905,"Permanent Title and Recording",0,null,null,null,null,null,36.479999999999905]
[36.489999999999903,"Other (describe):",0,null,null,null,null,null,36.489999999999903]
[36.499999999999901,"Other (describe):",0,null,null,null,null,null,36.499999999999901]
[]
[null,"LHC Risk-Sharing Fees",null,{"$f":"SUM(C87:C91)","v":0}]
[{"$f":"+I87","v":36.509999999999899},"Application Fee (3,000)",0,null,null,null,null,null,{"$f":"+I84+0.01","v":36.509999999999899}]
[{"$f":"+I88","v":36.519999999999897},"Commitment Fee (3% of loan amount)",0,null,null,null,null,null,{"$f":"+I87+0.01","v":36.519999999999897}]
[{"$f":"+I89","v":36.529999999999895},"Upfront MIP (.5% of loan amount)",0,null,null,null,null,null,{"$f":"+I88+0.01","v":36.529999999999895}]
[{"$f":"+I90","v":36.539999999999893},"Closing Fee (5,000)",0,null,null,null,null,null,{"$f":"+I89+0.01","v":36.539999999999893}]
[]
[null,"Professional Fees",null,{"$f":"SUM(C93:C96)","v":0}]
[{"$f":"+I93","v":36.549999999999891},"Accounting Fees",0,null,null,null,null,null,{"$f":"+I90+0.01","v":36.549999999999891}]
[{"$f":"+I94","v":36.559999999999889},"Architect Fees",0,null,{"$f":"IF(J383>0,\"Arch. Is \"&TEXT(J383,\"#,##0\")&\" above the limit\",\"\")","v":""},null,null,null,{"$f":"+I93+0.01","v":36.559999999999889}]
[{"$f":"+I95","v":36.569999999999887},"Engineering Fees",0,null,null,null,null,null,{"$f":"+I94+0.01","v":36.569999999999887}]
[]
[null,"Reserves",null,{"$f":"SUM(C98:C105)","v":0},null,null,null,null,null,null,"Exculded from the Developer Fee Calculation"]
[{"$f":"+I98","v":36.579999999999885},"Escrows",0,null,null,null,null,null,{"$f":"+I95+0.01","v":36.579999999999885}]
[36.589999999999883,"Operating Deficit Reserve",0,null,{"$f":"IF(C99<J99,\"Op. Rsv. must be at least \"&TEXT(J99,\"#,##0\"),\"\")","v":""},null,null,null,{"$f":"+I98+0.01","v":36.589999999999883},{"$f":"+'Revenues and Expenses'!C89/2","v":0},"LHC Minimum Operating Reserve"]
[36.599999999999881,"Rent Up Reserves",0,null,null,null,null,null,36.599999999999881]
[36.609999999999879,"Replacement Reserve Deposit",0,null,null,null,null,null,36.609999999999879]
[36.619999999999877,"Other:",0,null,null,null,null,null,36.619999999999877]
[36.629999999999875,"Other:",0,null,null,null,null,null,36.629999999999875]
[36.639999999999873,"Other:",0,null,null,null,null,null,36.639999999999873]
[]
[null,"Syndication Costs",null,{"$f":"SUM(C107:C110)","v":0},null,null,null,null,null,null,"Exculded from the Developer Fee Calculation"]
[{"$f":"+I107","v":36.649999999999871},"Syndication Legal Fees",0,null,null,null,null,null,{"$f":"+I104+0.01","v":36.649999999999871}]
[{"$f":"+I108","v":36.659999999999869},"Syndication Organization Expenses",0,null,null,null,null,null,{"$f":"+I107+0.01","v":36.659999999999869}]
[{"$f":"+I109","v":36.669999999999867},"Other Syndication Expenses",0,null,null,null,null,null,{"$f":"+I108+0.01","v":36.669999999999867}]
[]
[null,"Other Soft Costs",null,{"$f":"SUM(C112:C132)","v":0}]
[{"$f":"+I112","v":36.679999999999865},"Relocation Expenses",0,null,null,null,null,null,{"$f":"+I109+0.01","v":36.679999999999865}]
[36.689999999999863,"Appraisal",0,null,null,null,null,null,{"$f":"+I112+0.01","v":36.689999999999863}]
[36.699999999999861,"Market Study",0,null,null,null,null,null,36.699999999999861]
[36.709999999999859,"Environmental Study",0,null,null,null,null,null,36.709999999999859]
[36.719999999999857,"Environmental Review (HOME/Risk Sharing)",0,null,null,null,null,null,36.719999999999857]
[36.729999999999855,"Lead-Based Paint Assessment and Testing",0,null,null,null,null,null,36.729999999999855]
[36.739999999999853,"Survey",0,null,null,null,null,null,36.739999999999853]
[36.749999999999851,"Physical Capital Needs Assessment",0,null,null,null,null,null,36.749999999999851]
[36.759999999999849,"Marketing",0,null,null,null,null,null,36.759999999999849,null,"Exculded from the Developer Fee Calculation"]
[36.769999999999847,"Property Taxes",0,null,null,null,null,null,36.769999999999847]
[36.779999999999845,"Cost Certification",0,null,null,null,null,null,36.779999999999845]
[36.789999999999843,"Asset Management Fee",0,null,null,null,null,null,36.789999999999843]
[36.799999999999841,"LHC Non-Tax Credit Application Fee",0,null,null,null,null,null,36.799999999999841,null,"Exculded from the Developer Fee Calculation"]
[36.809999999999839,"LHC Tax Credit Application Fee",0,null,null,null,null,null,36.809999999999839,null,"Exculded from the Developer Fee Calculation"]
[36.819999999999837,"LHC Tax Credit Reservation Fee (5%)",0,null,null,null,null,null,36.819999999999837,null,"Exculded from the Developer Fee Calculation"]
[36.829999999999835,"LHC Fees other ",0,null,null,null,null,null,36.829999999999835,null,"Exculded from the Developer Fee Calculation"]
[36.839999999999833,"Non-LHC Tax Credit Fees",0,null,null,null,null,null,36.839999999999833,null,"Exculded from the Developer Fee Calculation"]
[36.849999999999831,"Other:  ",0,null,null,null,null,null,36.849999999999831]
[36.859999999999829,"Other:  ",0,null,null,null,null,null,36.859999999999829]
[36.869999999999827,"Other:  ",0,null,null,null,null,null,36.869999999999827]
[]
[null,"Developer's Fee",null,{"$f":"SUM(C134:C139)","v":0},{"$f":"IF('Project Description'!H12=\"Yes\",\"\",IFERROR(IF(J382>0,\"Dev Fee is \"&TEXT(J382,\"#,##0\")&\" above the limit\",\"\"),\"Primary Development Type is missing in Project Description\"))","v":""}]
[{"$f":"+I134","v":36.879999999999825},"Consulting Fee",0,null,null,null,null,null,{"$f":"+I131+0.01","v":36.879999999999825}]
[{"$f":"+I135","v":36.889999999999823},"Fees paid to CHDOs",0,null,null,null,null,null,{"$f":"+I134+0.01","v":36.889999999999823}]
[{"$f":"+I136","v":36.899999999999821},"Fees paid to nonprofits",0,null,null,null,null,null,{"$f":"+I135+0.01","v":36.899999999999821}]
[{"$f":"+I137","v":36.909999999999819},"Developer Fee  ",0,null,null,null,null,null,{"$f":"+I136+0.01","v":36.909999999999819}]
[{"$f":"+I138","v":36.919999999999817},"Other developer fee",0,null,null,null,null,null,{"$f":"+I137+0.01","v":36.919999999999817}]
[]
[null,"TOTAL DEVELOPMENT COSTS",null,{"$f":"SUM(D9:D139)","v":0}]
[]
[null,{"$f":"IF('Project Description'!H12=\"Yes\",\"\",IF(J142=0,\"\",\"There are Fee Limit problems; see Section \"&I373))","v":""},null,null,null,null,null,null,null,{"$f":"COUNTIF(J374:J386,\">0\")","v":0}]
[]
[null,"Comment on Development Costs"]
[]
[{"$f":"\"Section \"&I146","v":"Section 37"},"Do Sources and Uses Balance?",null,null,null,null,"QAP Reference",null,{"$f":"+I8+1","v":37}]
[]
[null,{"$f":"\"Total Permanent Sources of Funds (\"&'Project Description'!A510&\")\"","v":"Total Permanent Sources of Funds (Section 19)"},null,{"$f":"+'Project Description'!H529","v":0}]
[]
[null,"Total Development Costs",null,{"$f":"+D140","v":0}]
[]
[null,"Total Sources Minus TDC",null,{"$f":"+D148-D150","v":0}]
[null,{"$f":"IF(ROUND(D152,0)=0,\"\",\"Sources and Uses are out of Balance:\"&IF(D152<0,\" Sources Too Low\",\" Excess Sources\"))","v":""}]
[]
[{"$f":"\"Section \"&I155","v":"Section 38"},"Acquisition Basis and Construction Basis",null,null,null,null,"QAP Reference",null,{"$f":"+I146+1","v":38}]
[]
[{"$f":"+I157","v":38.01},"Calculation of Adjusted Acquisition Basis",null,null,null,null,null,null,{"$f":"+I155+0.01","v":38.01}]
[]
[null,"Building Acquisition",{"$f":"+C13","v":0}]
[null,"Adjustment (explain)",0]
[null,"Adjustment (explain)",0]
[null,"Adjustment (explain)",0]
[]
[null,"Adjusted Acquisition Basis",{"$f":"SUM(C158:C163)","v":0}]
[]
[null,"Comment on Acquisition Basis"]
[]
[{"$f":"+I168","v":38.019999999999996},"Calculation of Adjusted Construction Basis",null,null,null,null,null,null,{"$f":"+I157+0.01","v":38.019999999999996}]
[]
[null,"The computation below subtracts amounts that LHC understands are generally excluded from construction basis.  If your advisors conclude that any of the formula deductions are inappropriate for your transaction, use one of the Adjustment rows to add back amounts as appropriate.  Also use the Adjustment rows to exclude other amounts as appropriate for your transaction.  "]
[]
[null,"Total Development Cost",{"$f":"+D140","v":0}]
[null,"Subtract Adjusted Acquisition Basis",{"$f":"+-C164","v":0}]
[null,"Subtract Land Cost",{"$f":"+-C14-C15","v":0}]
[null,"Subtract the out-of-basis portion of:"]
[null,"Community Facilities",{"$f":"-'Project Description'!H580","v":0}]
[null,"Community Service Facilities",{"$f":"+-'Project Description'!H589","v":0}]
[null,"Subtract Commercial Development Cost",{"$f":"+-'Project Description'!H624","v":0}]
[null,"Subtract Permanent Financing Costs",{"$f":"+-D77","v":0}]
[null,"Subtract Reserves",{"$f":"+-D97","v":0}]
[null,"Subtract Syndication Costs",{"$f":"+-D106","v":0}]
[null,"Subtract LHC Fees",{"$f":"+-C124-C125-C126-C127","v":0}]
[null,"Subtract Federal Grants ",{"$f":"+-'Project Description'!H530","v":0},{"$f":"\"See Section \"&'Project Description'!L510","v":"See Section 19"}]
[null,"Subtract HOME",{"$f":"IF(AND('Project Description'!E362>0,'Project Description'!E360=Controls!A87),-'Project Description'!E362,0)","v":0}]
[null,"Subtract issuance costs for tax-exempt bonds",{"$f":"IF('Project Description'!H9=\"Yes\",-ABS('Project Description'!H18),0)","v":0},{"$f":"\"See Section \"&TEXT('Project Description'!A8,\"0.00\")","v":"See Section 10.01"}]
[null,"Adjustment (explain)",0]
[null,"Adjustment (explain)",0]
[null,"Adjustment (explain)",0]
[null,"Adjustment (explain)",0]
[null,"Adjustment (explain)",0]
[null,"Adjustment (explain)",0]
[]
[null,"Adjusted Construction Basis",{"$f":"SUM(C169:C192)","v":0}]
[]
[null,"Comment on Construction Basis"]
[]
[{"$f":"\"Section \"&I197","v":"Section 39"},"Total Development Cost Summary",null,null,null,null,"QAP Reference",null,{"$f":"+I155+1","v":39}]
[]
[null,"USES OF FUNDS / TOTAL DEVELOPMENT COST","TOTAL"]
[]
[{"$f":"+I201","v":39.01},"Building Acquisition",{"$f":"+C13","v":0},{"$f":"IF(J201=0,0,C201/J201)","v":0},"per unit",null,null,null,{"$f":"+I197+0.01","v":39.01},{"$f":"+'Unit Mix and Rents'!F41","v":0},"total units"]
[39.019999999999996,"Land Acquisition",{"$f":"+D12-C13","v":0},{"$f":"IF(J201=0,0,C202/J201)","v":0},"per unit",null,null,null,{"$f":"+I201+0.01","v":39.019999999999996}]
[39.029999999999994,"Construction Contract: New Construction ",{"$f":"+C23","v":0},{"$f":"IF(J201=0,0,C203/J201)","v":0},"per unit",null,null,null,{"$f":"+I202+0.01","v":39.029999999999994}]
[39.039999999999992,"Construction Contract: Rehab",{"$f":"+C24","v":0},{"$f":"IF(J201=0,0,C204/J201)","v":0},"per unit",null,null,null,39.039999999999992]
[39.04999999999999,"Other Construction Contract Building Costs",{"$f":"+D18-C204-C203","v":0},{"$f":"IF(J201=0,0,C205/J201)","v":0},"per unit",null,null,null,39.04999999999999]
[39.059999999999988,"Construction Contract: Site Work",{"$f":"+D28","v":0},{"$f":"IF(J201=0,0,C206/J201)","v":0},"per unit",null,null,null,39.059999999999988]
[39.069999999999986,"General Requirements",{"$f":"+C40","v":0},{"$f":"IF(J201=0,0,C207/J201)","v":0},"per unit",null,null,null,39.069999999999986]
[39.079999999999984,"Builder's Overhead",{"$f":"+C42","v":0},{"$f":"IF(J201=0,0,C208/J201)","v":0},"per unit",null,null,null,39.079999999999984]
[39.089999999999982,"Builder's Profit",{"$f":"+C43","v":0},{"$f":"IF(J201=0,0,C209/J201)","v":0},"per unit",null,null,null,39.089999999999982]
[39.09999999999998,"Other Construction Contract Costs",{"$f":"+D38-C209-C208-C207","v":0},{"$f":"IF(J201=0,0,C210/J201)","v":0},"per unit",null,null,null,39.09999999999998]
[39.109999999999978,"Hard Costs Outside Construction Contract",{"$f":"+D52","v":0},{"$f":"IF(J201=0,0,C211/J201)","v":0},"per unit",null,null,null,39.109999999999978]
[39.119999999999976,"Construction Hard Cost Contingency",{"$f":"+D59","v":0},{"$f":"IF(J201=0,0,C212/J201)","v":0},"per unit",null,null,null,39.119999999999976]
[39.129999999999974,"Total Construction Interim Costs",{"$f":"+D63","v":0},{"$f":"IF(J201=0,0,C213/J201)","v":0},"per unit",null,null,null,39.129999999999974]
[39.139999999999972,"Total Permanent Financing Costs",{"$f":"+D77","v":0},{"$f":"IF(J201=0,0,C214/J201)","v":0},"per unit",null,null,null,39.139999999999972]
[39.14999999999997,"Total LHC Risk-Sharing Fees",{"$f":"+D86","v":0},{"$f":"IF(J201=0,0,C215/J201)","v":0},"per unit",null,null,null,39.14999999999997]
[39.159999999999968,"Total Professional Fees",{"$f":"+D92","v":0},{"$f":"IF(J201=0,0,C216/J201)","v":0},"per unit",null,null,null,39.159999999999968]
[39.169999999999966,"Escrows",{"$f":"+C98","v":0},{"$f":"IF(J201=0,0,C217/J201)","v":0},"per unit",null,null,null,39.169999999999966]
[39.179999999999964,"Operating Deficit Reserve",0,{"$f":"IF(J201=0,0,C218/J201)","v":0},"per unit",null,null,null,39.179999999999964]
[39.189999999999962,"Rent Up Reserves",0,{"$f":"IF(J201=0,0,C219/J201)","v":0},"per unit",null,null,null,39.189999999999962]
[39.19999999999996,"Replacement Reserve Deposit IDRR",0,{"$f":"IF(J201=0,0,C220/J201)","v":0},"per unit",null,null,null,39.19999999999996]
[39.209999999999958,"Other:",0,{"$f":"IF(J201=0,0,C221/J201)","v":0},"per unit",null,null,null,39.209999999999958]
[39.219999999999956,"Other:",0,{"$f":"IF(J201=0,0,C222/J201)","v":0},"per unit",null,null,null,39.219999999999956]
[39.229999999999954,"Other:",0,{"$f":"IF(J201=0,0,C223/J201)","v":0},"per unit",null,null,null,39.229999999999954]
[39.239999999999952,"Total Syndication Costs",{"$f":"+D106","v":0},{"$f":"IF(J201=0,0,C224/J201)","v":0},"per unit",null,null,null,39.239999999999952]
[39.24999999999995,"Total Other Soft Costs",{"$f":"+D111","v":0},{"$f":"IF(J201=0,0,C225/J201)","v":0},"per unit",null,null,null,39.24999999999995]
[39.259999999999948,"Developer Fee",{"$f":"+C137","v":0},{"$f":"IF(J201=0,0,C226/J201)","v":0},"per unit",null,null,null,39.259999999999948]
[39.269999999999946,"Other Developer's Fee",{"$f":"+D133-C226","v":0},{"$f":"IF(J201=0,0,C227/J201)","v":0},"per unit",null,null,null,39.269999999999946]
[]
[null,"Total Development Cost (Total Uses of Funds)",{"$f":"SUM(C200:C228)","v":0},{"$f":"IF(J201=0,0,C229/J201)","v":0},"per unit",null,null,null,null,{"$f":"+D140-C229","v":0}]
[]
[{"$f":"\"Section \"&I231","v":"Section 40"},"HUD TDC Per Unit Limit",null,null,null,null,"QAP Reference",null,{"$f":"+I197+1","v":40}]
[]
[null,"Parish",{"$f":"+'Project Description'!E87","v":"Select"}]
[null,"Louisiana Cost Area for TDC Limit Purposes",{"$f":"+K234","v":{"$error":"#N/A"}},null,null,null,null,null,null,null,{"$f":"VLOOKUP(C233,Parishes!A10:X73,24,FALSE)","v":{"$error":"#N/A"}}]
[null,"Primary Building Type",{"$f":"+'Project Description'!H117","v":"Missing"},null,null,"Maximum"]
[null,"Building Type for TDC Limit Purposes",{"$f":"VLOOKUP(C235,Controls!A49:B58,2,FALSE)","v":"Walkup"},null,"TDC / Unit","TDC      ",null,null,null,null,{"$f":"TRIM(C234&\" \"&C236)","v":{"$error":"#N/A"}}]
[]
[null,"0 BR Units",{"$f":"+'Unit Mix and Rents'!AU41","v":0},"units",{"$f":"VLOOKUP(K236,'HUD TDC Data'!C8:J35,K238,FALSE)","v":{"$error":"#N/A"}},{"$f":"+C238*E238","v":{"$error":"#N/A"}},null,null,null,null,2]
[null,"1 BR Units",{"$f":"+'Unit Mix and Rents'!AV41","v":0},"units",{"$f":"VLOOKUP(K236,'HUD TDC Data'!C8:J35,K239,FALSE)","v":{"$error":"#N/A"}},{"$f":"+C239*E239","v":{"$error":"#N/A"}},null,null,null,null,3]
[null,"2 BR Units",{"$f":"+'Unit Mix and Rents'!AW41","v":0},"units",{"$f":"VLOOKUP(K236,'HUD TDC Data'!C8:J35,K240,FALSE)","v":{"$error":"#N/A"}},{"$f":"+C240*E240","v":{"$error":"#N/A"}},null,null,null,null,4]
[null,"3 BR Units",{"$f":"+'Unit Mix and Rents'!AX41","v":0},"units",{"$f":"VLOOKUP(K236,'HUD TDC Data'!C8:J35,K241,FALSE)","v":{"$error":"#N/A"}},{"$f":"+C241*E241","v":{"$error":"#N/A"}},null,null,null,null,5]
[null,"4 BR Units",{"$f":"+'Unit Mix and Rents'!AY41","v":0},"units",{"$f":"VLOOKUP(K236,'HUD TDC Data'!C8:J35,K242,FALSE)","v":{"$error":"#N/A"}},{"$f":"+C242*E242","v":{"$error":"#N/A"}},null,null,null,null,6]
[]
[null,"Total",{"$f":"SUM(C235:C243)","v":0},"units",{"$f":"IF(C244=0,0,+F244/C244)","v":0},{"$f":"SUM(F235:F243)","v":{"$error":"#N/A"}},"= Maximum TDC Limit",null,null,{"$f":"+F254+-F248","v":0}," Adjusted TDC, adding back Extraordinary Site Costs"]
[null,null,null,null,null,null,null,null,null,{"$f":"IF(J244>F244,\"Yes\",\"No\")","v":{"$error":"#N/A"}}," Above the limit, when ESC added back?"]
[null,"Compare to Estimated TDC",null,null,null,null,null,null,null,{"$f":"IF(F255>1,\"Yes\",\"No\")","v":{"$error":"#N/A"}}," Above the limit, after subtracting ESC?"]
[null,"Total Development Cost (above)",null,null,null,{"$f":"+C229","v":0},null,null,null,{"$f":"IF(AND(J245=\"Yes\",J246=\"No\"),\"Yes\",\"No\")","v":{"$error":"#N/A"}}," Extraordinary Site Costs needed, to be below TDC Max?"]
[null,"Subtract Extraordinary Site Costs",null,null,null,{"$f":"+-'Project Description'!H574","v":0}]
[null,"Subtract Community Facilities Costs",null,null,null,{"$f":"+-'Project Description'!H578","v":0},null,null,null,{"$f":"IF('Project Description'!H161=\"Yes\",\"Yes\",\"No\")","v":"No"}," Is this an SRO Project?"]
[null,"Subtract Community Service Facility Costs",null,null,null,{"$f":"+-'Project Description'!H587","v":0},null,null,null,{"$f":"IF('Project Description'!H162=\"Yes\",\"Yes\",\"No\")","v":"No"}," Is this an anti-discrimination project?"]
[null,"Subtract Excess Costs",null,null,null,{"$f":"+-'Project Description'!H597","v":0}]
[null,"Subtract Reserves",null,null,null,{"$f":"+-D97","v":0}]
[]
[null,"Adjusted TDC",null,null,null,{"$f":"SUM(F246:F253)","v":0},null,null,null,{"$f":"IF(AND(F255>1,J249=\"No\",J250=\"No\"),\"Yes\",\"No\")","v":{"$error":"#N/A"}}," Above TDC max and neither SRO nor anti-discrimination project?"]
[null,"Adjusted TDC as % of Maximum TDC Limit",null,null,null,{"$f":"IF(F244=0,0,+F254/F244)","v":{"$error":"#N/A"}}]
[null,{"$f":"IF(AND(F255>1,J249=\"Yes\"),J256,IF(AND(F255>1,J250=\"Yes\"),J257,\"\"))","v":{"$error":"#N/A"}},null,null,null,null,null,null,null,"Adjusted TDC exceeds the Maximum TDC Limit and this is an SRO Project; there will be a question on the Checklist worksheet."]
[null,{"$f":"IF(J254=\"Yes\",\"Adjusted TDC exceeds the Maximum TDC Limit and no exception appears to be available under the QAP.\",\"\")","v":{"$error":"#N/A"}},null,null,null,null,null,null,null,"Adjusted TDC exceeds the Maximum TDC Limit and this is an anti-discrimination project; there will be a question on the Checklist worksheet."]
[]
[null,"Comment on TDC Limits"]
[]
[{"$f":"\"Section \"&I261","v":"Section 41"},"Fee Limit Computations",null,null,null,null,"QAP Reference",null,{"$f":"+I231+1","v":41}]
[]
[null,"The Builder Profit Fee Base is defined in the QAP Glossary; it includes hard costs and does not include compensation to the general contractor. The construction contingency amount is not included in the formula below, because the QAP definition is clear that only actual hard costs contribute toward the Builder Profit Fee Base.  The actual Builder Profit Fee Base will be determined in the post-construction-completion Subsidy Layering Review, based on the cost certification.  The computation below is solely for the purpose of determining builder compensation limits at the time of application."]
[]
[{"$f":"+I265","v":41.01},"Calculate the 'Builder Profit Fee Base'",null,null,null,null,null,null,{"$f":"+I261+0.01","v":41.01}]
[]
[null,"Total Construction Contract: Building Costs",{"$f":"+D18","v":0}]
[null,"Total Construction Contract: Site Work",{"$f":"+D28","v":0}]
[null,"Total Construction Contract: Other Costs",{"$f":"+D38","v":0}]
[null,"Subtotal: Construction Contract",{"$f":"SUM(C266:C269)","v":0}]
[null,"Minus Proposed General Requirements",{"$f":"+-C40","v":0}]
[null,"Minus Proposed General Overhead",{"$f":"+-C42","v":0}]
[null,"Minus Proposed Builder Fee / Profit",{"$f":"+-C43","v":0}]
[]
[null,"Equals Builder Profit Fee Base",{"$f":"SUM(C270:C274)","v":0}]
[]
[{"$f":"+I277","v":41.019999999999996},"General Requirements",null,null,null,null,{"$f":"+'QAP Reference'!A76","v":"IV.D"},null,{"$f":"+I265+0.01","v":41.019999999999996}]
[]
[null,"Builder Profit Fee Base",{"$f":"+C275","v":0}]
[null,{"$f":"\"Allowable \"&B277","v":"Allowable General Requirements"},{"$f":"ROUND(C279*D280,0)","v":0},0.06]
[null,{"$f":"\"Proposed \"&B277","v":"Proposed General Requirements"},{"$f":"-C271","v":0},null,null,null,null,null,null,{"$f":"ROUND(C281-C280,0)","v":0}]
[null,{"$f":"IF(J281>0,\"Proposed amount is \"&TEXT(J281,\"#,##0\")&\" above the limit\",IF(J281<0,\"Proposed amount is \"&TEXT(-J281,\"#,##0\")&\" below the limit\",\"\"))","v":""}]
[]
[{"$f":"+I284","v":41.029999999999994},"General Overhead",null,null,null,null,{"$f":"+'QAP Reference'!A76","v":"IV.D"},null,{"$f":"+I277+0.01","v":41.029999999999994}]
[]
[null,"Builder Profit Fee Base",{"$f":"+C275","v":0}]
[null,{"$f":"\"Allowable \"&B284","v":"Allowable General Overhead"},{"$f":"ROUND(C286*D287,0)","v":0},0.02]
[null,{"$f":"\"Proposed \"&B284","v":"Proposed General Overhead"},{"$f":"+-C272","v":0},null,null,null,null,null,null,{"$f":"ROUND(C288-C287,0)","v":0}]
[null,{"$f":"IF(J288>0,\"Proposed amount is \"&TEXT(J288,\"#,##0\")&\" above the limit\",IF(J288<0,\"Proposed amount is \"&TEXT(-J288,\"#,##0\")&\" below the limit\",\"\"))","v":""}]
[]
[{"$f":"+I291","v":41.039999999999992},"Builder Fee / Profit",null,null,null,null,{"$f":"+'QAP Reference'!A76","v":"IV.D"},null,{"$f":"+I284+0.01","v":41.039999999999992}]
[]
[null,"Builder Profit Fee Base",{"$f":"+C275","v":0}]
[null,{"$f":"\"Allowable \"&B291","v":"Allowable Builder Fee / Profit"},{"$f":"ROUND(C293*D294,0)","v":0},0.06]
[null,{"$f":"\"Proposed \"&B291","v":"Proposed Builder Fee / Profit"},{"$f":"+-C273","v":0},null,null,null,null,null,null,{"$f":"ROUND(C295-C294,0)","v":0}]
[null,{"$f":"IF(J295>0,\"Proposed amount is \"&TEXT(J295,\"#,##0\")&\" above the limit\",IF(J295<0,\"Proposed amount is \"&TEXT(-J295,\"#,##0\")&\" below the limit\",\"\"))","v":""}]
[null,"Tenant Relocation Offsite?","No"]
[null,"Existing LIHTC Property",{"$f":"'Project Description'!Q144","v":"Missing"}]
[{"$f":"+I299","v":41.04999999999999},"Calculate the Developer Fee Base",null,null,null,null,"Glossary",null,{"$f":"+I291+0.01","v":41.04999999999999}]
[null,"Proposed Total Development Cost",{"$f":"+D140","v":0}]
[null,{"$f":"IF(C297=\"Yes\",\"\",\"Subtract Proposed Total Acquisition Cost\")","v":"Subtract Proposed Total Acquisition Cost"},{"$f":"IF(C297=\"Yes\",\"\",-D12)","v":0}]
[null,"Subtract Lease Payments (Self-Owned Equip.)",{"$f":"+-C41","v":0}]
[null,"Subtract Payments to Related Parties",{"$f":"+-'Project Description'!H569","v":0},null,null,null,null,null,{"$f":"'Development Costs'!C303","v":0}]
[null,"Subtract Proposed Total Developer's Fee",{"$f":"+-D133","v":0}]
[null,"Subtract Reserves*",{"$f":"+-SUM(C218:C223)","v":0},"* LHC's position is that reserves are not 'development costs' unless expended for a development cost prior to the placed in service date."]
[null,"Subtract Syndication Costs",{"$f":"+-D106","v":0}]
[null,"Marketing",{"$f":"+-D120","v":0}]
[null,"LHC Non-Tax Credit Application Fee",{"$f":"+-D124","v":0}]
[null,"LHC Tax Credit Application Fee",{"$f":"+-D125","v":0}]
[null,"LHC Tax Credit Reservation Fee (5%)",{"$f":"+-D126","v":0}]
[null,"LHC Fees other ",{"$f":"+-D127","v":0}]
[null,"Equals Developer Fee Base",{"$f":"SUM(C299:C311)","v":0}]
[]
[{"$f":"+I314","v":41.059999999999988},"Calculate the Acquisition Cost Base",null,null,null,null,"Glossary",null,{"$f":"+I299+0.01","v":41.059999999999988}]
[null,"Proposed Total Acquisition Cost","=+D12"]
[null,"Subtract Acquisition Fee","=+-C16"]
[]
[null,"Equals Acquisition Cost Base","=SUM(C309:C312)"]
[]
[{"$f":"+I320","v":41.069999999999986},"Calculate the Developer Fee Limit",null,null,null,null,{"$f":"+'QAP Reference'!A76","v":"IV.D"},null,{"$f":"+I314+0.01","v":41.069999999999986}]
[]
[null,"Total units in project",{"$f":"+'Unit Mix and Rents'!F41","v":0}]
[null,"Project qualifies for what % of Dev. Fee Base?",{"$f":"IF(OR('Project Description'!H70=\"Yes\",'Project Description'!H73=\"Yes\"),L323,J323)","v":0.15},null,null,null,null,null,null,0.15,"Standard",0.18,"NP/CHDO"]
[]
[null,{"$f":"\"Project qualifies for \"&TEXT(J328,\"0%\")&\" of Acq. Cost Base?\"","v":"Project qualifies for 8% of Acq. Cost Base?"},"=IF('Project Description'!H141=\"Yes\",\"Yes\",\"No\")"]
[]
[null,{"$f":"TEXT(C323,\"0.0%\")&\" of Developer Fee Base\"","v":"15.0% of Developer Fee Base"},{"$f":"ROUND(C312*15%,0)","v":0}]
[null,{"$f":"TEXT(J328,\"0.0%\")&\" of Acq. Cost Base\"","v":"8.0% of Acq. Cost Base"},"=IF(C325=\"Yes\",ROUND(C318*J328,0),0)",null,null,null,null,null,null,0.08]
[null,{"$f":"TEXT(J329,\"0.0%\")&\" of Acq. Cost Base\"","v":"5.0% of Acq. Cost Base"},"=IF(C325<>\"Yes\",ROUND(C318*J329,0),0)",null,null,null,null,null,null,0.05]
[null,"Excess Syndication Costs","=+-C352"]
[null,null,null,null,null,null,null,null,{"$f":"UPPER('Project Description'!H9)","v":"MISSING"},{"$f":"IF('Project Description'!H95=\"Acquisition & Rehab\",\"YES\",\"NO\")","v":"NO"},{"$f":"IF('Project Description'!H95=\"New Construction\",\"YES\",\"NO\")","v":"NO"}]
[null,null,null,null,null,null,null,null,"Bond","Rehab","New",{"$f":"UPPER('Project Description'!H133)","v":"MISSING"},{"$f":"IF(L332=\"NO\",\"YES\",\"NO\")","v":"NO"}]
[null,"Developer Fee Limit",{"$f":"IF(I331=\"YES\",C327,IF(AND(J331=\"YES\",L332=\"YES\"),L335,IF(AND(K331=\"YES\",L332=\"YES\"),L336,IF(AND(J331=\"YES\",M332=\"YES\"),M335,IF(AND(K331=\"YES\",M332=\"YES\"),M336,0)))))","v":0},null,null,null,null,null,{"$f":"IF('Project Description'!H9=\"Yes\",IF(J331=\"YES\",J333,K333),0)","v":0},{"$f":"IF(J331=\"YES\",C327,0)","v":0},{"$f":"IF('Project Description'!H95=\"New Construction\",C327,0)","v":0},"Rural","Metro"]
[null,"Proposed Total Developer's Fee",{"$f":"+D133","v":0},null,{"$f":"IF('Project Description'!H12=\"Yes\",\"\",IFERROR(IF(J382>0,\"Dev Fee is \"&TEXT(J382,\"#,##0\")&\" above the limit\",\"\"),\"Primary Development Type is missing in Project Description\"))","v":""},null,null,null,null,{"$f":"ROUND(C334-C333,0)","v":0},null,2000000,2000000]
[null,null,null,null,null,null,null,null,null,null,"Rehab",{"$f":"IF(IF(L332=\"YES\",J333,0)>L334,L334,IF(L332=\"YES\",J333,0))","v":0},{"$f":"IF(IF(M332=\"YES\",J333,0)>M334,M334,IF(M332=\"YES\",J333,0))","v":0}]
[{"$f":"+I336","v":41.079999999999984},"Calculate the Architect Fee Limit",null,null,null,null,{"$f":"+'QAP Reference'!A76","v":"IV.D"},null,{"$f":"+I320+0.01","v":41.079999999999984},null,"New",{"$f":"IF(IF(L332=\"YES\",K333,0)>L334,L334,IF(L332=\"YES\",K333,0))","v":0},{"$f":"IF(IF(M332=\"YES\",K333,0)>M334,M334,IF(M332=\"YES\",K333,0))","v":0}]
[]
[null,{"$f":"TEXT(J338,\"0.0%\")&\" of Construction Contract\"","v":"7.0% of Construction Contract"},{"$f":"ROUND(C270*J338,0)","v":0},null,null,null,null,null,null,7.0000000000000007E-2]
[null,"Proposed Architect Fee",{"$f":"+C94","v":0},null,null,null,null,null,null,{"$f":"ROUND(C339-C338,0)","v":0}]
[]
[{"$f":"+I341","v":41.089999999999982},"Calculate Excess Syndication Costs",null,null,null,null,{"$f":"+'QAP Reference'!A76","v":"IV.D"},null,{"$f":"+I336+0.01","v":41.089999999999982}]
[]
[null,"At this point, fill out the Syndication worksheet.  Information from that worksheet is needed to complete this section."]
[]
[null,"Syndication Costs Paid by Syndicator",{"$f":"+Syndication!J30","v":0},"Syndication Certification Line I.G"]
[null,"Syndication Costs in TDC",{"$f":"+D106","v":0}]
[]
[null,"Total Syndication Costs",{"$f":"SUM(C342:C347)","v":0}]
[]
[null,"Syndication Placement Type",{"$f":"+Syndication!M170","v":"Private"},"See Syndication Certification"]
[]
[null,"Gross Equity",{"$f":"+Syndication!J26","v":0},"Syndication Certification Line I.E"]
[null,{"$f":"TEXT(J353,\"0.0%\")&\" of Gross Equity (Private Placement)\"","v":"10.0% of Gross Equity (Private Placement)"},{"$f":"IF(C350=\"Private\",ROUND(C352*J353,0),0)","v":0},null,null,null,null,null,null,0.1]
[null,{"$f":"TEXT(J354,\"0.0%\")&\" of Gross Equity (Public Placement)\"","v":"15.0% of Gross Equity (Public Placement)"},{"$f":"IF(C350<>\"Private\",ROUND(C352*J354,0),0)","v":0},null,null,null,null,null,null,0.15]
[]
[null,"Syndication Cost Limit",{"$f":"+C354+C353","v":0}]
[null,"Total Syndication Costs",{"$f":"+C348","v":0},null,null,null,null,null,null,{"$f":"ROUND(C357-C356,0)","v":0}]
[null,"Excess Syndication Costs",{"$f":"IF(AND(C357>0,C357>C356),C357-C356,0)","v":0}]
[null,{"$f":"IF(C358=0,\"\",\"The excess syndication costs will be treated as developer fee per QAP Section \"&G341)","v":""}]
[]
[{"$f":"+I361","v":41.09999999999998},"Test Subcontractor Limits",null,null,null,null,{"$f":"+'QAP Reference'!A79","v":"IV.D"},null,{"$f":"+I341+0.01","v":41.09999999999998}]
[]
[null,{"$f":"+'Project Description'!B552:F552","v":0},{"$f":"+'Project Description'!H552","v":0},{"$f":"TEXT(J363,\"0.0%\")&\" of Construction Contract\"","v":"0.0% of Construction Contract"},null,null,null,null,null,{"$f":"IF(C270=0,0,+C363/C270)","v":0}]
[null,{"$f":"+'Project Description'!B553:F553","v":0},{"$f":"+'Project Description'!H553","v":0},{"$f":"TEXT(J364,\"0.0%\")&\" of Construction Contract\"","v":"0.0% of Construction Contract"},null,null,null,null,null,{"$f":"IF(C270=0,0,+C364/C270)","v":0}]
[null,{"$f":"+'Project Description'!B554:F554","v":0},{"$f":"+'Project Description'!H554","v":0},{"$f":"TEXT(J365,\"0.0%\")&\" of Construction Contract\"","v":"0.0% of Construction Contract"},null,null,null,null,null,{"$f":"IF(C270=0,0,+C365/C270)","v":0}]
[]
[null,"Total for Top Three",{"$f":"SUM(C362:C366)","v":0},{"$f":"TEXT(J367,\"0.0%\")&\" of Construction Contract\"","v":"0.0% of Construction Contract"},null,null,null,null,null,{"$f":"IF(C270=0,0,+C367/C270)","v":0}]
[]
[null,{"$f":"IF(OR(J363>50%,J367>75%),\"No General Overhead or Builder Profit is allowed; see QAP \"&G361,\"\")","v":""}]
[]
[null,"Comment on Fee Limits"]
[]
[{"$f":"\"Section \"&I373","v":"Section 42"},"Fee Limit Violations",null,null,null,null,"QAP Reference",null,{"$f":"+I261+1","v":42}]
[]
[null,"The QAP defines individual limits for various fee and profit items. For purposes of your application, each proposed fee or profit must be below the applicable limit. ",null,null,null,null,null,null,{"$f":"'Project Description'!H9","v":"Missing"},"Transaction includes tax-exempt bond financing?"]
[null,{"$f":"IF(AND(I375=\"Yes\",I376=\"Yes\"),\"This is a Bond Financed 4% transaction; this software assumes that the developer fee limit does not apply.\",\"The developer fee limit applies to this transaction.\")","v":"The developer fee limit applies to this transaction."},null,null,null,null,null,null,{"$f":"+'Project Description'!H12","v":"Missing"},"Transaction includes 4% LIHTCs?"]
[]
[]
[null,{"$f":"IF(J379>0,\"The proposed \"&K379&\" amount is \"&TEXT(J379,\"#,##0\")&\" above the limit.\",\"\")","v":""},null,null,null,{"$f":"IF(J379>0,\"See Section \"&N379,\"\")","v":""},null,null,null,{"$f":"+J281","v":0},"General Requirements",null,null,{"$f":"+I277","v":41.019999999999996}]
[null,{"$f":"IF(J380>0,\"The proposed \"&K380&\" amount is \"&TEXT(J380,\"#,##0\")&\" above the limit.\",\"\")","v":""},null,null,null,"",null,null,null,{"$f":"+J288","v":0},"General Overhead",null,null,{"$f":"+I284","v":41.029999999999994}]
[null,{"$f":"IF(J381>0,\"The proposed \"&K381&\" amount is \"&TEXT(J381,\"#,##0\")&\" above the limit.\",\"\")","v":""},null,null,null,"",null,null,null,{"$f":"+J295","v":0},"Builder Fee / Profit",null,null,{"$f":"+I291","v":41.039999999999992}]
[null,{"$f":"IF(AND(I375=\"Yes\",I376=\"Yes\"),\"\",IF(J382>0,\"The proposed \"&K382&\" amount is \"&TEXT(J382,\"#,##0\")&\" above the limit.\",\"\"))","v":""},null,null,null,"",null,null,null,{"$f":"+J334","v":0},"Developer Fee",null,null,{"$f":"+I320","v":41.069999999999986}]
[null,{"$f":"IF(J383>0,\"The proposed \"&K383&\" amount is \"&TEXT(J383,\"#,##0\")&\" above the limit.\",\"\")","v":""},null,null,null,"",null,null,null,{"$f":"+J339","v":0},"Architect Fee",null,null,{"$f":"+I336","v":41.079999999999984}]
[null,{"$f":"IF(J384>0,\"The proposed \"&K384&\" amount is \"&TEXT(J384,\"#,##0\")&\" above the limit.\",\"\")","v":""},null,null,null,"",null,null,null,{"$f":"+J357","v":0},"Syndication Cost",null,null,{"$f":"+I341","v":41.089999999999982}]
[null,{"$f":"+B369","v":""},null,null,null,"",null,null,null,{"$f":"IF(B369=\"\",0,1)","v":0},null,null,null,{"$f":"+I361","v":41.09999999999998}]
[]
[]
[]
[]
[]
[]
[]
[]
[]
[]
[null,null,null,null,null,null,null,null,{"$f":"+I373","v":42},"Last Section on this worksheet"]

{"sheet":"Basis Calculation","index":10,"n_rows":63,"n_cols":21,"rows_kept":63,"cut":false,"hidden":false,"merged":[]}
[]
[]
[{"$f":"+Instructions!A3","v":"2025 QAP Underwriting Application v1.1"}]
[{"$f":"TRIM('Project Description'!E84)&\" (\"&TRIM('Project Description'!E86)&\" LA), \"&'Project Description'!E50","v":" ( LA), "}]
[]
["Basis Calculation",null,null,{"$f":"IF(C9<'Project Description'!H603,1,0)","v":0},{"$f":"IF(D9<'Project Description'!H603,1,0)","v":0},{"$f":"IF(E9<'Project Description'!H603,1,0)","v":0},{"$f":"IF(F9<'Project Description'!H603,1,0)","v":0},{"$f":"IF(G9<'Project Description'!H603,1,0)","v":0},{"$f":"IF(H9<'Project Description'!H603,1,0)","v":0},{"$f":"IF(I9<'Project Description'!H603,1,0)","v":0},{"$f":"IF(J9<'Project Description'!H603,1,0)","v":0},{"$f":"IF(K9<'Project Description'!H603,1,0)","v":0},{"$f":"IF(L9<'Project Description'!H603,1,0)","v":0},{"$f":"IF(M9<'Project Description'!H603,1,0)","v":0},{"$f":"IF(N9<'Project Description'!H603,1,0)","v":0},{"$f":"IF(O9<'Project Description'!H603,1,0)","v":0},{"$f":"IF(P9<'Project Description'!H603,1,0)","v":0},{"$f":"IF(Q9<'Project Description'!H603,1,0)","v":0},{"$f":"IF(R9<'Project Description'!H603,1,0)","v":0},{"$f":"IF(S9<'Project Description'!H603,1,0)","v":0},{"$f":"IF(T9<'Project Description'!H603,1,0)","v":0}]
[null,{"$f":"IF(K57=0,\"\",\"Note -- there are error conditions; see the Notes at the end of this worksheet\")","v":""}]
[null,null,"Total","Configuration",{"$f":"IF(E6=1,\"Configuration\",\"\")","v":""},{"$f":"IF(F6=1,\"Configuration\",\"\")","v":""},"","","","","","","","","","","","","","",""]
[null,"BUILDING CONFIGURATION",{"$f":"+'Project Description'!H603","v":0},1,{"$f":"IF(E6=1,+D9+1,\"\")","v":""},{"$f":"IF(F6=1,+E9+1,\"\")","v":""},"","","","","","","","","","","","","","",""]
[null,{"$f":"IF('Project Description'!H204=0,\"THIS SECTION IS NOT REQUIRED BECAUSE THERE ARE NO TAX CREDITS REQUESTED\",\"\")","v":"THIS SECTION IS NOT REQUIRED BECAUSE THERE ARE NO TAX CREDITS REQUESTED"}]
[null,"Number of Buildings with Configuration",{"$f":"SUM(D11:U11)","v":0}]
[]
[{"$f":"+'Project Description'!H639+'Project Description'!H640","v":0},"Floor Area of Residential Units + Staff Units",{"$f":"SUMPRODUCT(D13:U13,D11:U11)","v":0}]
[{"$f":"+A16-A13-A15","v":0},"Other (Common Areas, …)",{"$f":"SUMPRODUCT(D14:U14,D11:U11)","v":0}]
[{"$f":"'Project Description'!H641","v":0},"Other (Comml)",{"$f":"SUMPRODUCT(D15:U15,D12:U12)","v":0}]
[{"$f":"+'Project Description'!H646","v":0},"Per Building Total Area",{"$f":"SUMPRODUCT(D16:U16,D11:U11)","v":0},{"$f":"SUM(D13:D14)","v":0},{"$f":"IF(E6=1,SUM(E13:E14),\"\")","v":""},"","","","","","","","","","","","","","","",""]
[]
[{"$f":"+'Unit Mix and Rents'!G41","v":0},"Number of  LIHTC Units",{"$f":"SUMPRODUCT(D18:U18,D11:U11)","v":0},null,null,null,"","","","",""]
[{"$f":"+'Unit Mix and Rents'!F56","v":0},"Number of  Residential Units",{"$f":"SUMPRODUCT(D19:U19,D11:U11)","v":0},null,null,null,"","","","",""]
[null,"Applicable Fraction by Units",null,{"$f":"IF(D19=0,0,+D18/D19)","v":0},{"$f":"IF(E6=1,IF(E19=0,0,E18/E19),\"\")","v":""},"","","","","","","","","","","","","","","",""]
[]
[{"$f":"+'Unit Mix and Rents'!E45","v":0},"Sqft of LIHTC Units ",{"$f":"SUMPRODUCT(D22:U22,D11:U11)","v":0}]
[{"$f":"+'Unit Mix and Rents'!E56","v":0},"Total Sqft of Residential Units",{"$f":"SUMPRODUCT(D23:U23,D11:U11)","v":0}]
[null,"Applicable Fraction by Sqft",null,{"$f":"IF(D23=0,0,+D22/D23)","v":0},{"$f":"IF(E6=1,IF(E23=0,0,E22/E23),\"\")","v":""},"","","","","","","","","","","","","","","",""]
[]
[null,"BASIS CALCULATION"]
[]
[{"$f":"+'Development Costs'!C193","v":0},"Adjusted Construction Basis",{"$f":"SUMPRODUCT(D28:U28,D11:U11)","v":0},{"$f":"IF(C16=0,0,ROUND((D16/C16)*'Development Costs'!C193,0))","v":0},{"$f":"IF(E6=1,ROUND((E16/C16)*'Development Costs'!C193,0),0)","v":0},{"$f":"IF(F6=1,ROUND((F16/C16)*'Development Costs'!C193,0),0)","v":0},{"$f":"IF(G6=1,ROUND((G16/C16)*'Development Costs'!C193,0),0)","v":0},{"$f":"IF(H6=1,ROUND((H16/C16)*'Development Costs'!C193,0),0)","v":0},{"$f":"IF(I6=1,ROUND((I16/C16)*'Development Costs'!C193,0),0)","v":0},{"$f":"IF(J6=1,ROUND((J16/C16)*'Development Costs'!C193,0),0)","v":0},{"$f":"IF(K6=1,ROUND((K16/C16)*'Development Costs'!C193,0),0)","v":0},{"$f":"IF(L6=1,ROUND((L16/C16)*'Development Costs'!C193,0),0)","v":0},{"$f":"IF(M6=1,ROUND((M16/C16)*'Development Costs'!C193,0),0)","v":0},{"$f":"IF(N6=1,ROUND((N16/C16)*'Development Costs'!C193,0),0)","v":0},{"$f":"IF(O6=1,ROUND((O16/C16)*'Development Costs'!C193,0),0)","v":0},{"$f":"IF(P6=1,ROUND((P16/C16)*'Development Costs'!C193,0),0)","v":0},{"$f":"IF(Q6=1,ROUND((Q16/C16)*'Development Costs'!C193,0),0)","v":0},{"$f":"IF(R6=1,ROUND((R16/C16)*'Development Costs'!C193,0),0)","v":0},{"$f":"IF(S6=1,ROUND((S16/C16)*'Development Costs'!C193,0),0)","v":0},{"$f":"IF(T6=1,ROUND((T16/C16)*'Development Costs'!C193,0),0)","v":0},{"$f":"IF(U6=1,ROUND((U16/C16)*'Development Costs'!C193,0),0)","v":0}]
[{"$f":"+'Development Costs'!C164","v":0},"Adjusted Acquisition Basis",{"$f":"SUMPRODUCT(D29:U29,D11:U11)","v":0},{"$f":"IF(C16=0,0,ROUND((D13/C16)*'Development Costs'!C164,0))","v":0},{"$f":"IF(E6=1,ROUND((E13/C16)*'Development Costs'!C164,0),0)","v":0},{"$f":"IF(F6=1,ROUND((F13/C16)*'Development Costs'!C164,0),0)","v":0},{"$f":"IF(G6=1,ROUND((G13/C16)*'Development Costs'!C164,0),0)","v":0},{"$f":"IF(H6=1,ROUND((H13/C16)*'Development Costs'!C164,0),0)","v":0},{"$f":"IF(I6=1,ROUND((I13/C16)*'Development Costs'!C164,0),0)","v":0},{"$f":"IF(J6=1,ROUND((J13/C16)*'Development Costs'!C164,0),0)","v":0},{"$f":"IF(K6=1,ROUND((K13/C16)*'Development Costs'!C164,0),0)","v":0},{"$f":"IF(L6=1,ROUND((L13/C16)*'Development Costs'!C164,0),0)","v":0},{"$f":"IF(M6=1,ROUND((M13/C16)*'Development Costs'!C164,0),0)","v":0},{"$f":"IF(N6=1,ROUND((N13/C16)*'Development Costs'!C164,0),0)","v":0},{"$f":"IF(O6=1,ROUND((O13/C16)*'Development Costs'!C164,0),0)","v":0},{"$f":"IF(P6=1,ROUND((P13/C16)*'Development Costs'!C164,0),0)","v":0},{"$f":"IF(Q6=1,ROUND((Q13/C16)*'Development Costs'!C164,0),0)","v":0},{"$f":"IF(R6=1,ROUND((R13/C16)*'Development Costs'!C164,0),0)","v":0},{"$f":"IF(S6=1,ROUND((S13/C16)*'Development Costs'!C164,0),0)","v":0},{"$f":"IF(T6=1,ROUND((T13/C16)*'Development Costs'!C164,0),0)","v":0},{"$f":"IF(U6=1,ROUND((U13/C16)*'Development Costs'!C164,0),0)","v":0}]
[]
[{"$f":"+'Project Description'!H219+1","v":1},"Construction Basis After Boost",{"$f":"SUMPRODUCT(D31:U31,D11:U11)","v":0},{"$f":"+D28*A31","v":0},{"$f":"IF(E6=1,+E28*A31,\"\")","v":""},{"$f":"IF(F6=1,+F28*A31,\"\")","v":""},{"$f":"IF(G6=1,+G28*A31,\"\")","v":""},{"$f":"IF(H6=1,+H28*A31,\"\")","v":""},{"$f":"IF(I6=1,+I28*A31,\"\")","v":""},{"$f":"IF(J6=1,+J28*A31,\"\")","v":""},{"$f":"IF(K6=1,+K28*A31,\"\")","v":""},{"$f":"IF(L6=1,+L28*A31,\"\")","v":""},{"$f":"IF(M6=1,+M28*A31,\"\")","v":""},{"$f":"IF(N6=1,+N28*A31,\"\")","v":""},{"$f":"IF(O6=1,+O28*A31,\"\")","v":""},{"$f":"IF(P6=1,+P28*A31,\"\")","v":""},{"$f":"IF(Q6=1,+Q28*A31,\"\")","v":""},{"$f":"IF(R6=1,+R28*A31,\"\")","v":""},{"$f":"IF(S6=1,+S28*A31,\"\")","v":""},{"$f":"IF(T6=1,+T28*A31,\"\")","v":""},{"$f":"IF(U6=1,+U28*A31,\"\")","v":""}]
[{"$f":"+'Project Description'!H220+1","v":1},"Acquisition Basis After Boost",{"$f":"SUMPRODUCT(D32:U32,D11:U11)","v":0},{"$f":"+D29*A32","v":0},{"$f":"IF(E6=1,+E29*A32,\"\")","v":""},{"$f":"IF(F6=1,+F29*A32,\"\")","v":""},{"$f":"IF(G6=1,+G29*A32,\"\")","v":""},{"$f":"IF(H6=1,+H29*A32,\"\")","v":""},{"$f":"IF(I6=1,+I29*A32,\"\")","v":""},{"$f":"IF(J6=1,+J29*A32,\"\")","v":""},{"$f":"IF(K6=1,+K29*A32,\"\")","v":""},{"$f":"IF(L6=1,+L29*A32,\"\")","v":""},{"$f":"IF(M6=1,+M29*A32,\"\")","v":""},{"$f":"IF(N6=1,+N29*A32,\"\")","v":""},{"$f":"IF(O6=1,+O29*A32,\"\")","v":""},{"$f":"IF(P6=1,+P29*A32,\"\")","v":""},{"$f":"IF(Q6=1,+Q29*A32,\"\")","v":""},{"$f":"IF(R6=1,+R29*A32,\"\")","v":""},{"$f":"IF(S6=1,+S29*A32,\"\")","v":""},{"$f":"IF(T6=1,+T29*A32,\"\")","v":""},{"$f":"IF(U6=1,+U29*A32,\"\")","v":""}]
[]
[null,"Applicable Fraction ",{"$f":"IF(C31=0,0,+C36/C31)","v":0},{"$f":"MIN(D24,D20)","v":0},{"$f":"IF(E6=1,MIN(E24,E20),\"\")","v":""},"","","","","","","","","","","","","","","",""]
[]
[null,"Unadjusted Qualified Construction Basis",{"$f":"SUMPRODUCT(D36:U36,D11:U11)","v":0},{"$f":"+D34*D31","v":0},{"$f":"IF(E6=1,+E34*E31,\"\")","v":""},"","","","","","","","","","","","","","","",""]
[null,"Unadjusted Qualified Acquisition. Basis ",{"$f":"SUMPRODUCT(D37:U37,D11:U11)","v":0},{"$f":"+D34*D32","v":0},{"$f":"IF(E6=1,E34*E32,\"\")","v":""},"","","","","","","","","","","","","","","",""]
[]
[null,"Homeless Basis Adjustment (Construction)*",{"$f":"SUMPRODUCT(D39:U39,D11:U11)","v":0},0,0,0,0,0,0,0,0,0,0,0,0,0,0,0,0,0,0]
[null,"Homeless Basis Adjustment (Acquisition)*",{"$f":"SUMPRODUCT(D40:U40,D11:U11)","v":0},0,0,0,0,0,0,0,0,0,0,0,0,0,0,0,0,0,0]
[]
[null,"Qualified Construction Basis",{"$f":"SUMPRODUCT(D42:U42,D11:U11)","v":0},{"$f":"+D39+D36","v":0},{"$f":"IF(E6=1,+E36+E39,\"\")","v":""},"","","","","","","","","","","","","","","",""]
[null,"Qualified Acquisition Basis",{"$f":"SUMPRODUCT(D43:U43,D11:U11)","v":0},{"$f":"+D40+D37","v":0},{"$f":"IF(E6=1,+E37+E40,\"\")","v":""},"","","","","","","","","","","","","","","",""]
[]
[null,"Construction Credit Percentage",{"$f":"IF('Project Description'!H23=\"Yes\",'Project Description'!H207,IF('Project Description'!H12=\"Yes\",'Project Description'!H15,0))","v":0}]
[null,"Acquisition Credit Percentage",{"$f":"IF('Project Description'!H23=\"Yes\",+'Project Description'!H209,IF('Project Description'!H12=\"Yes\",'Project Description'!H15,0))","v":0}]
[]
[]
[null,"Permitted Construction Credit",{"$f":"SUMPRODUCT(D49:U49,D11:U11)","v":0},{"$f":"+D42*C45","v":0},{"$f":"IF(E6=1,+E42*C45,\"\")","v":""},{"$f":"IF(F6=1,+F42*C45,\"\")","v":""},{"$f":"IF(G6=1,+G42*C45,\"\")","v":""},{"$f":"IF(H6=1,+H42*C45,\"\")","v":""},{"$f":"IF(I6=1,+I42*C45,\"\")","v":""},{"$f":"IF(J6=1,+J42*C45,\"\")","v":""},{"$f":"IF(K6=1,+K42*C45,\"\")","v":""},{"$f":"IF(L6=1,+L42*C45,\"\")","v":""},{"$f":"IF(M6=1,+M42*C45,\"\")","v":""},{"$f":"IF(N6=1,+N42*C45,\"\")","v":""},{"$f":"IF(O6=1,+O42*C45,\"\")","v":""},{"$f":"IF(P6=1,+P42*C45,\"\")","v":""},{"$f":"IF(Q6=1,+Q42*C45,\"\")","v":""},{"$f":"IF(R6=1,+R42*C45,\"\")","v":""},{"$f":"IF(S6=1,+S42*C45,\"\")","v":""},{"$f":"IF(T6=1,+T42*C45,\"\")","v":""},{"$f":"IF(U6=1,+U42*C45,\"\")","v":""}]
[null,"Permitted Acquisition Credi",{"$f":"SUMPRODUCT(D50:U50,D11:U11)","v":0},{"$f":"+D43*C46","v":0},{"$f":"IF(E6=1,+E43*C46,\"\")","v":""},{"$f":"IF(F6=1,+F43*C46,\"\")","v":""},{"$f":"IF(G6=1,+G43*C46,\"\")","v":""},{"$f":"IF(H6=1,+H43*C46,\"\")","v":""},{"$f":"IF(I6=1,+I43*C46,\"\")","v":""},{"$f":"IF(J6=1,+J43*C46,\"\")","v":""},{"$f":"IF(K6=1,+K43*C46,\"\")","v":""},{"$f":"IF(L6=1,+L43*C46,\"\")","v":""},{"$f":"IF(M6=1,+M43*C46,\"\")","v":""},{"$f":"IF(N6=1,+N43*C46,\"\")","v":""},{"$f":"IF(O6=1,+O43*C46,\"\")","v":""},{"$f":"IF(P6=1,+P43*C46,\"\")","v":""},{"$f":"IF(Q6=1,+Q43*C46,\"\")","v":""},{"$f":"IF(R6=1,+R43*C46,\"\")","v":""},{"$f":"IF(S6=1,+S43*C46,\"\")","v":""},{"$f":"IF(T6=1,+T43*C46,\"\")","v":""},{"$f":"IF(U6=1,+U43*C46,\"\")","v":""}]
[]
[null,"Maximum Permitted Credit for Project",{"$f":"+C50+C49","v":0}]
[null,"(Based on estimated development costs, without regard to Equity Gap limitation and without regard to maximum credits allowable in the selected pool)"]
[]
[null,"* Section 42(c)(1)(E) permits an upward adjustment to basis for buildings used at least in part \"to provide supportive services designed to assist [homeless] tenants in locating and retaiing permanent housing\"."]
[]
[null,"Error checks:",null,null,null,null,null,null,null,null,{"$f":"SUM(K58:K63)","v":0}]
[null,{"$f":"IF(C11='Project Description'!H602,\"\",\"Note 1 -- Total number of buildings (\"&C11&\" buildings) does not agree with Project Description section \"&'Project Description'!A600&\" (\"&'Project Description'!H602&\" buildings)\")","v":""},null,null,null,null,null,null,null,null,{"$f":"IF(B58=\"\",\"\",1)","v":""}]
[null,{"$f":"IF(A13=C13,\"\",\"Note 2 -- Total Floor Area (Residential + Staff Units) of \"&TEXT(C13,\"#,##0\")&\" square feet, does not agree with Unit Mix and Rents worksheet (\"&TEXT(A13,\"#,##0\")&\" square feet)\")","v":""},null,null,null,null,null,null,null,null,""]
[null,{"$f":"IF(A18=C18,\"\",\"Note 3 -- Total LIHTC Units (\"&TEXT(C18,\"#,##0\")&\" units) does not agree with Unit Mix and Rents worksheet (\"&TEXT(A18,\"#,##0\")&\" units)\")","v":""},null,null,null,null,null,null,null,null,""]
[null,{"$f":"IF(A19=C19,\"\",\"Note 4 -- Total Residential Units (\"&TEXT(C19,\"#,##0\")&\" units) does not agree with Unit Mix and Rents worksheet (\"&TEXT(A19,\"#,##0\")&\" units)\")","v":""},null,null,null,null,null,null,null,null,""]
[null,{"$f":"IF(A22=C22,\"\",\"Note 5 -- Total LIHTC Units Floor Area (\"&TEXT(C22,\"#,##0\")&\" sqft) does not agree with Unit Mix and Rents worksheet (\"&TEXT(A22,\"#,##0\")&\" sqft)\")","v":""},null,null,null,null,null,null,null,null,""]
[null,{"$f":"IF(A23=C23,\"\",\"Note 6 -- Total Residential Floor Area (\"&TEXT(C23,\"#,##0\")&\" sqft) does not agree with Unit Mix and Rents worksheet (\"&TEXT(A23,\"#,##0\")&\" sqft)\")","v":""},null,null,null,null,null,null,null,null,""]

{"sheet":"Revenues and Expenses","index":11,"n_rows":110,"n_cols":13,"rows_kept":110,"cut":false,"hidden":false,"merged":[[99,10,99,18],[94,1,94,2],[86,1,86,4],[86,10,86,18],[90,1,90,4],[92,1,92,4],[3,0,3,4],[26,1,26,2],[98,0,98,2],[99,0,99,2],[109,1,109,2]]}
[]
[]
[{"$f":"+Instructions!A3","v":"2025 QAP Underwriting Application v1.1"}]
[{"$f":"TRIM('Project Description'!E84)&\" (\"&TRIM('Project Description'!E86)&\" LA), \"&'Project Description'!E50","v":" ( LA), "}]
[]
["Revenues and Expenses, For First Stabilized Year After Lease-Up"]
[]
[{"$f":"\"Section \"&H8","v":"Section 43"},"Revenues for First Stabilized Year",null,null,null,null,null,{"$f":"+'Development Costs'!I396+1","v":43}]
[]
[{"$f":"+H10","v":43.01},"Gross Potential Rents (excluding utilities)",{"$f":"+'Unit Mix and Rents'!L41*12","v":0},null,null,null,null,{"$f":"+H8+0.01","v":43.01}]
[43.019999999999996,"Rent from Commercial Space",0,null,null,null,null,{"$f":"+H10+0.01","v":43.019999999999996}]
[43.029999999999994,"Interest Income",0,null,null,null,null,{"$f":"+H11+0.01","v":43.029999999999994}]
[43.039999999999992,"Laundry Income",0,null,null,null,null,43.039999999999992]
[43.04999999999999,"Parking Income",0,null,null,null,null,43.04999999999999]
[43.059999999999988,"Tenant Charges (e.g. late fees)",0,null,null,null,null,43.059999999999988]
[null,"Operating Subsidies:"]
[{"$f":"+H17","v":43.069999999999986},"Other (identify)",0,null,null,null,null,{"$f":"+H15+0.01","v":43.069999999999986}]
[{"$f":"+H18","v":43.079999999999984},"Other (identify)",0,null,null,null,null,43.079999999999984]
[{"$f":"+H19","v":43.089999999999982},"Other (identify)",0,null,null,null,null,43.089999999999982]
[null,"Other Revenue:"]
[{"$f":"+H21","v":43.09999999999998},"Other (identify)",0,null,null,null,null,{"$f":"+H19+0.01","v":43.09999999999998}]
[{"$f":"+H22","v":43.109999999999978},"Other (identify)",0,null,null,null,null,43.109999999999978]
[{"$f":"+H23","v":43.119999999999976},"Other (identify)",0,null,null,null,null,43.119999999999976]
[]
[{"$f":"+H25","v":43.129999999999974},"Total Revenue Before Rent Loss",{"$f":"SUM(C9:C24)","v":0},null,null,null,null,{"$f":"+H23+0.01","v":43.129999999999974}]
[]
[null,"Comment regarding Revenues"]
[]
[{"$f":"\"Section \"&H29","v":"Section 44"},"Must-Pay Operating Expenses for First Stabilized Year",null,null,null,null,null,{"$f":"+H8+1","v":44}]
[]
[{"$f":"+H31","v":44.01},"Administrative Expenses:",{"$f":"SUM(C32:C51)","v":0},{"$f":"IF(I31=0,0,C31/I31)","v":0},"PUPA",null,null,{"$f":"+H29+0.01","v":44.01},{"$f":"+'Unit Mix and Rents'!F41","v":0},"total units"]
[{"$f":"+H32","v":44.019999999999996},"Accounting Services",0,null,null,null,null,{"$f":"+H31+0.01","v":44.019999999999996}]
[44.029999999999994,"Administrative Rent Free Unit(s)",0,null,null,null,null,{"$f":"+H32+0.01","v":44.029999999999994}]
[44.039999999999992,"Bad Debt",0,null,null,null,null,44.039999999999992]
[44.04999999999999,"Rent Concessions",0,null,null,null,null,44.04999999999999]
[44.059999999999988,"Advertising ",0,null,null,null,null,44.059999999999988]
[44.069999999999986,"LHC Compliance Monitoring Fee",{"$f":"+'Project Description'!H1043","v":0},null,null,null,null,44.069999999999986]
[44.079999999999984,"Compliance Fees (Other)",0,null,null,null,null,44.079999999999984]
[44.089999999999982,"LHC Asset Management Fee",0,null,null,null,null,44.089999999999982]
[44.09999999999998,"Asset Management Fee (Other)",0,null,null,null,null,44.09999999999998]
[44.109999999999978,"Legal Auditing",0,null,null,null,null,44.109999999999978]
[44.119999999999976,"Management Fee",0,null,null,null,null,44.119999999999976]
[44.129999999999974,"Manager(s) Salaries",0,null,null,null,null,44.129999999999974]
[44.139999999999972,"Office Salaries",0,null,null,null,null,44.139999999999972]
[44.14999999999997,"Office Supplies",0,null,null,null,null,44.14999999999997]
[44.159999999999968,"Telephone",0,null,null,null,null,44.159999999999968]
[44.169999999999966,"Supportive Services Expense",0,null,null,null,null,44.169999999999966]
[44.179999999999964,"Other (identify)",0,null,null,null,null,44.179999999999964]
[44.189999999999962,"Other (identify)",0,null,null,null,null,44.189999999999962]
[44.19999999999996,"Other (identify)",null,null,null,null,null,44.19999999999996]
[]
[44.209999999999958,"Operating/Maintenance Expenses:",{"$f":"SUM(C53:C63)","v":0},{"$f":"IF(I31=0,0,C52/I31)","v":0},"PUPA",null,null,{"$f":"+H50+0.01","v":44.209999999999958}]
[44.219999999999956,"Elevator Maintenance/Contract",0,null,null,null,null,44.219999999999956]
[44.229999999999954,"Exterminating Contract",0,null,null,null,null,44.229999999999954]
[44.239999999999952,"Grounds Expense",0,null,null,null,null,44.239999999999952]
[44.24999999999995,"Janitorial Services",0,null,null,null,null,44.24999999999995]
[44.259999999999948,"Repairs/Maintenance",0,null,null,null,null,44.259999999999948]
[44.269999999999946,"Security Payroll/Contract",0,null,null,null,null,44.269999999999946]
[44.279999999999944,"Waste Collection",0,null,null,null,null,44.279999999999944]
[44.289999999999942,"Other (identify)",0,null,null,null,null,44.289999999999942]
[44.29999999999994,"Other (identify)",0,null,null,null,null,44.29999999999994]
[44.309999999999938,"Other (identify)",0,null,null,null,null,44.309999999999938]
[]
[44.319999999999936,"Utilities Expenses:",{"$f":"SUM(C65:C72)","v":0},{"$f":"IF(I31=0,0,C64/I31)","v":0},"PUPA",null,null,{"$f":"+H62+0.01","v":44.319999999999936}]
[44.329999999999934,"Electricity",0,null,null,null,null,44.329999999999934]
[44.339999999999932,"Gas",0,null,null,null,null,44.339999999999932]
[44.34999999999993,"Sewer",0,null,null,null,null,44.34999999999993]
[44.359999999999928,"Water",0,null,null,null,null,44.359999999999928]
[44.369999999999926,"Other (identify):",0,null,null,null,null,44.369999999999926]
[44.379999999999924,"Other (identify)",0,null,null,null,null,44.379999999999924]
[44.389999999999922,"Other (identify)",0,null,null,null,null,44.389999999999922]
[]
[44.39999999999992,"Tax and Insurance Expenses:",{"$f":"SUM(C74:C82)","v":0},{"$f":"IF(I31=0,0,C73/I31)","v":0},"PUPA",null,null,{"$f":"+H71+0.01","v":44.39999999999992}]
[44.409999999999918,"Property Insurance",0,null,null,null,null,44.409999999999918]
[44.419999999999916,"Other Insurance",0,null,null,null,null,44.419999999999916]
[44.429999999999914,"Payroll Taxes",0,null,null,null,null,44.429999999999914]
[44.439999999999912,"Real Estate Taxes",0,null,null,null,null,44.439999999999912]
[44.44999999999991,"Workmen's Compensation",0,null,null,null,null,44.44999999999991]
[44.459999999999908,"Other (identify):",0,null,null,null,null,44.459999999999908]
[44.469999999999906,"Other (identify)",0,null,null,null,null,44.469999999999906]
[44.479999999999905,"Other (identify)",0,null,null,null,null,44.479999999999905]
[]
[44.489999999999903,"Total Operating Expenses",{"$f":"+C73+C64+C52+C31","v":0},{"$f":"IF(I31=0,0,C83/I31)","v":0},"PUPA",null,null,{"$f":"+H81+0.01","v":44.489999999999903}]
[]
[null,{"$f":"\"LHC Minimum Expenses (QAP \"&I85&\")\"","v":"LHC Minimum Expenses (QAP IV.D.9)"},{"$f":"+D85*'Unit Mix and Rents'!F41","v":0},{"$f":"+K85","v":4500},"PUPA",null,null,null,{"$f":"+'QAP Reference'!A33","v":"IV.D.9"},null,4500,"PUPA","Updated in the 2025 QAP"]
[]
[null,{"$f":"IF(C83<C85,K87,\"\")","v":""},null,null,null,null,null,null,null,null,"You have proposed total operating expenses that are below the minimum level specified in the QAP.  Either increase the operating expenses so they are at or above LHC's minimum, or your Checklist response must include a waiver request."]
[]
[null,"Use These Expenses for Underwriting",{"$f":"+C83","v":0},{"$f":"IF(I31=0,0,C89/I31)","v":0},"PUPA"]
[]
[null,{"$f":"IF(AND('Project Description'!H117=Controls!A51,'Revenues and Expenses'!C53=0),\"This is an elevator building; explain why no elevator maintenance was budgeted.\",\"\")","v":""}]
[]
[null,{"$f":"IF(C40>0,\"Asset Management Fees (Other) is generally not permitted as an ‘above the line’ operating expense, and may be structured to be paid only from the sponsor’s share of Surplus Cash—input any such fee at Section 45.01 below.\",IF(C39<>0,\"Include a full explanation of the proposed asset management fee(s) below.\",\"\"))","v":""}]
[]
[null,"Comment regarding Must-Pay Expenses"]
[]
[{"$f":"\"Section \"&H97","v":"Section 45"},"Contingent Operating Expenses",null,null,null,null,null,{"$f":"+H29+1","v":45}]
[]
["Please explain below any operating expenses that are payable only if cash is available, and/or after certain other payments are made first from available cash flow. Please use the comment area below if additional explanation is needed."]
[{"$f":"IF('Project Description'!H195=0,\"\",K100)","v":""},null,null,null,null,null,null,null,null,null,"You have applied for CDBG-DR funds. Note that expenses such as the following cannot be paid from operations, but instead can be paid only from the borrower's share of Surplus Cash: deferred developer fee, other development costs, tax credit adjusters, most asset management fees, and investor service fees."]
[]
[{"$f":"+H102","v":45.01},"Asset Management Fee",0,null,null,null,null,{"$f":"+H97+0.01","v":45.01},null,{"$f":"+C102+C40","v":0},"Total asset mgmt fee (must-pay + contingent)"]
[45.019999999999996,"Investor Service Fee",0,null,null,null,null,{"$f":"+H102+0.01","v":45.019999999999996},null,5000,"Maximum allowable as operating expense (combination of must-pay + contingent)"]
[45.029999999999994,"Other (identify)",0,null,null,null,null,45.029999999999994,null,{"$f":"MIN(J103,J102)","v":0},"Allowable as operating expense for this transaction"]
[45.039999999999992,"Other (identify)",0,null,null,null,null,45.039999999999992,null,{"$f":"+J104-C40","v":0},"Allowable as contingent expense for this transaction"]
[45.04999999999999,"Other (identify)",0,null,null,null,null,45.04999999999999]
[45.059999999999988,"Other (identify)",0,null,null,null,null,45.059999999999988]
[45.069999999999986,"Other (identify)",0,null,null,null,null,45.069999999999986]
[]
[45.079999999999984,"Comment regarding Contingent Expenses",null,null,null,null,null,{"$f":"+H108+0.01","v":45.079999999999984}]

{"sheet":"Proforma","index":12,"n_rows":53,"n_cols":42,"rows_kept":53,"cut":false,"hidden":false,"merged":[]}
[]
[]
[{"$f":"+Instructions!A3","v":"2025 QAP Underwriting Application v1.1"}]
[{"$f":"TRIM('Project Description'!E84)&\" (\"&TRIM('Project Description'!E86)&\" LA), \"&'Project Description'!E50","v":" ( LA), "}]
[]
["Pro Forma Cash Flows"]
[]
[9,null,null,null,null,null,null,{"$f":"+'Unit Mix and Rents'!F41","v":0},"Units"]
[null,null,1,{"$f":"+C9+1","v":2},{"$f":"+D9+1","v":3},4,5,6,7,8,9,10,11,12,13,14,15,16,17,18,19,20,21,22,23,24,25,26,27,28,29,30,31,32,33,34,35,{"$f":"+AK9+1","v":36},{"$f":"+AL9+1","v":37},{"$f":"+AM9+1","v":38},{"$f":"+AN9+1","v":39},{"$f":"+AO9+1","v":40}]
[{"$f":"ROW(A10)-A8","v":1},null,"Year 1","Year 2","Year 3","Year 4","Year 5","Year 6","Year 7","Year 8","Year 9","Year 10","Year 11","Year 12","Year 13","Year 14","Year 15","Year 16","Year 17","Year 18","Year 19","Year 20","Year 21","Year 22","Year 23","Year 24","Year 25","Year 26","Year 27","Year 28","Year 29","Year 30","Year 31","Year 32","Year 33","Year 34","Year 35","Year 36","Year 37","Year 38","Year 39","Year 40"]
[{"$f":"ROW(A11)-A8","v":2}]
[{"$f":"ROW(A12)-A8","v":3},"Rent Loss %",{"$f":"+'Project Description'!H957","v":7.0000000000000007E-2},{"$f":"+'Project Description'!H957","v":7.0000000000000007E-2},{"$f":"+'Project Description'!H957","v":7.0000000000000007E-2},{"$f":"+'Project Description'!H959","v":7.0000000000000007E-2},{"$f":"+F12","v":7.0000000000000007E-2},{"$f":"+G12","v":7.0000000000000007E-2},7.0000000000000007E-2,7.0000000000000007E-2,7.0000000000000007E-2,7.0000000000000007E-2,7.0000000000000007E-2,7.0000000000000007E-2,7.0000000000000007E-2,7.0000000000000007E-2,7.0000000000000007E-2,7.0000000000000007E-2,7.0000000000000007E-2,7.0000000000000007E-2,7.0000000000000007E-2,7.0000000000000007E-2,7.0000000000000007E-2,7.0000000000000007E-2,7.0000000000000007E-2,7.0000000000000007E-2,7.0000000000000007E-2,7.0000000000000007E-2,7.0000000000000007E-2,7.0000000000000007E-2,7.0000000000000007E-2,7.0000000000000007E-2,7.0000000000000007E-2,7.0000000000000007E-2,7.0000000000000007E-2,7.0000000000000007E-2,7.0000000000000007E-2,{"$f":"+AK12","v":7.0000000000000007E-2},{"$f":"+AL12","v":7.0000000000000007E-2},{"$f":"+AM12","v":7.0000000000000007E-2},{"$f":"+AN12","v":7.0000000000000007E-2},{"$f":"+AO12","v":7.0000000000000007E-2}]
[{"$f":"ROW(A13)-A8","v":4}]
[{"$f":"ROW(A14)-A8","v":5},"Gross Rent Potential",{"$f":"+'Revenues and Expenses'!C10","v":0},{"$f":"ROUND(C14*(1+'Project Description'!H961),0)","v":0},{"$f":"ROUND(D14*(1+'Project Description'!H961),0)","v":0},{"$f":"ROUND(E14*(1+'Project Description'!H963),0)","v":0},{"$f":"ROUND(F14*(1+'Project Description'!H963),0)","v":0},{"$f":"ROUND(G14*(1+'Project Description'!H963),0)","v":0},{"$f":"ROUND(H14*(1+'Project Description'!H963),0)","v":0},{"$f":"ROUND(I14*(1+'Project Description'!H963),0)","v":0},{"$f":"ROUND(J14*(1+'Project Description'!H963),0)","v":0},{"$f":"ROUND(K14*(1+'Project Description'!H963),0)","v":0},{"$f":"ROUND(L14*(1+'Project Description'!H963),0)","v":0},{"$f":"ROUND(M14*(1+'Project Description'!H963),0)","v":0},{"$f":"ROUND(N14*(1+'Project Description'!H963),0)","v":0},{"$f":"ROUND(O14*(1+'Project Description'!H963),0)","v":0},{"$f":"ROUND(P14*(1+'Project Description'!H963),0)","v":0},{"$f":"ROUND(Q14*(1+'Project Description'!$H$967),0)","v":0},{"$f":"ROUND(R14*(1+'Project Description'!$H$967),0)","v":0},{"$f":"ROUND(S14*(1+'Project Description'!$H$967),0)","v":0},{"$f":"ROUND(T14*(1+'Project Description'!$H$967),0)","v":0},{"$f":"ROUND(U14*(1+'Project Description'!$H$967),0)","v":0},{"$f":"ROUND(V14*(1+'Project Description'!$H$967),0)","v":0},{"$f":"ROUND(W14*(1+'Project Description'!$H$967),0)","v":0},{"$f":"ROUND(X14*(1+'Project Description'!$H$967),0)","v":0},{"$f":"ROUND(Y14*(1+'Project Description'!$H$967),0)","v":0},{"$f":"ROUND(Z14*(1+'Project Description'!$H$967),0)","v":0},{"$f":"ROUND(AA14*(1+'Project Description'!$H$967),0)","v":0},{"$f":"ROUND(AB14*(1+'Project Description'!$H$967),0)","v":0},{"$f":"ROUND(AC14*(1+'Project Description'!$H$967),0)","v":0},{"$f":"ROUND(AD14*(1+'Project Description'!$H$967),0)","v":0},{"$f":"ROUND(AE14*(1+'Project Description'!$H$967),0)","v":0},{"$f":"ROUND(AF14*(1+'Project Description'!$H$967),0)","v":0},{"$f":"ROUND(AG14*(1+'Project Description'!$H$967),0)","v":0},{"$f":"ROUND(AH14*(1+'Project Description'!$H$967),0)","v":0},{"$f":"ROUND(AI14*(1+'Project Description'!$H$967),0)","v":0},{"$f":"ROUND(AJ14*(1+'Project Description'!$H$967),0)","v":0},{"$f":"ROUND(AK14*(1+'Project Description'!$H$967),0)","v":0},{"$f":"ROUND(AL14*(1+'Project Description'!$H$967),0)","v":0},{"$f":"ROUND(AM14*(1+'Project Description'!$H$967),0)","v":0},{"$f":"ROUND(AN14*(1+'Project Description'!$H$967),0)","v":0},{"$f":"ROUND(AO14*(1+'Project Description'!$H$967),0)","v":0}]
[{"$f":"ROW(A15)-A8","v":6},"Rent Loss",{"$f":"-ROUND(C14*C12,0)","v":0},{"$f":"-ROUND(D14*D12,0)","v":0},0,0,0,0,0,0,0,0,0,0,0,0,0,0,0,0,0,0,0,0,0,0,0,0,0,0,0,0,0,0,0,0,0,{"$f":"-ROUND(AL14*AL12,0)","v":0},{"$f":"-ROUND(AM14*AM12,0)","v":0},{"$f":"-ROUND(AN14*AN12,0)","v":0},{"$f":"-ROUND(AO14*AO12,0)","v":0},{"$f":"-ROUND(AP14*AP12,0)","v":0}]
[{"$f":"ROW(A16)-A8","v":7},"Rent from Commercial Space",{"$f":"+'Revenues and Expenses'!C11","v":0},{"$f":"ROUND(C16*(1+'Project Description'!H961),0)","v":0},{"$f":"ROUND(D16*(1+'Project Description'!H961),0)","v":0},{"$f":"ROUND(E16*(1+'Project Description'!H963),0)","v":0},{"$f":"ROUND(F16*(1+'Project Description'!H963),0)","v":0},{"$f":"ROUND(G16*(1+'Project Description'!H963),0)","v":0},{"$f":"ROUND(H16*(1+'Project Description'!H963),0)","v":0},{"$f":"ROUND(I16*(1+'Project Description'!H963),0)","v":0},{"$f":"ROUND(J16*(1+'Project Description'!H963),0)","v":0},{"$f":"ROUND(K16*(1+'Project Description'!H963),0)","v":0},{"$f":"ROUND(L16*(1+'Project Description'!H963),0)","v":0},{"$f":"ROUND(M16*(1+'Project Description'!H963),0)","v":0},{"$f":"ROUND(N16*(1+'Project Description'!H963),0)","v":0},{"$f":"ROUND(O16*(1+'Project Description'!H963),0)","v":0},{"$f":"ROUND(P16*(1+'Project Description'!H963),0)","v":0},{"$f":"ROUND(Q16*(1+'Project Description'!H963),0)","v":0},{"$f":"ROUND(R16*(1+'Project Description'!H963),0)","v":0},{"$f":"ROUND(S16*(1+'Project Description'!H963),0)","v":0},{"$f":"ROUND(T16*(1+'Project Description'!H963),0)","v":0},{"$f":"ROUND(U16*(1+'Project Description'!H963),0)","v":0},{"$f":"ROUND(V16*(1+'Project Description'!H963),0)","v":0},{"$f":"ROUND(W16*(1+'Project Description'!H963),0)","v":0},{"$f":"ROUND(X16*(1+'Project Description'!H963),0)","v":0},{"$f":"ROUND(Y16*(1+'Project Description'!H963),0)","v":0},{"$f":"ROUND(Z16*(1+'Project Description'!H963),0)","v":0},{"$f":"ROUND(AA16*(1+'Project Description'!H963),0)","v":0},{"$f":"ROUND(AB16*(1+'Project Description'!H963),0)","v":0},{"$f":"ROUND(AC16*(1+'Project Description'!H963),0)","v":0},{"$f":"ROUND(AD16*(1+'Project Description'!H963),0)","v":0},{"$f":"ROUND(AE16*(1+'Project Description'!H963),0)","v":0},{"$f":"ROUND(AF16*(1+'Project Description'!H963),0)","v":0},{"$f":"ROUND(AG16*(1+'Project Description'!H963),0)","v":0},{"$f":"ROUND(AH16*(1+'Project Description'!H963),0)","v":0},{"$f":"ROUND(AI16*(1+'Project Description'!H963),0)","v":0},{"$f":"ROUND(AJ16*(1+'Project Description'!H963),0)","v":0},{"$f":"ROUND(AK16*(1+'Project Description'!H963),0)","v":0},{"$f":"ROUND(AL16*(1+'Project Description'!H963),0)","v":0},{"$f":"ROUND(AM16*(1+'Project Description'!H963),0)","v":0},{"$f":"ROUND(AN16*(1+'Project Description'!H963),0)","v":0},{"$f":"ROUND(AO16*(1+'Project Description'!H963),0)","v":0}]
[{"$f":"ROW(A17)-A8","v":8},"Interest",{"$f":"+'Revenues and Expenses'!C12","v":0},{"$f":"ROUND(C17*(1+'Project Description'!H961),0)","v":0},{"$f":"ROUND(D17*(1+'Project Description'!H961),0)","v":0},{"$f":"ROUND(E17*(1+'Project Description'!H963),0)","v":0},{"$f":"ROUND(F17*(1+'Project Description'!H963),0)","v":0},{"$f":"ROUND(G17*(1+'Project Description'!H963),0)","v":0},{"$f":"ROUND(H17*(1+'Project Description'!H963),0)","v":0},{"$f":"ROUND(I17*(1+'Project Description'!H963),0)","v":0},{"$f":"ROUND(J17*(1+'Project Description'!H963),0)","v":0},{"$f":"ROUND(K17*(1+'Project Description'!H963),0)","v":0},{"$f":"ROUND(L17*(1+'Project Description'!H963),0)","v":0},{"$f":"ROUND(M17*(1+'Project Description'!H963),0)","v":0},{"$f":"ROUND(N17*(1+'Project Description'!H963),0)","v":0},{"$f":"ROUND(O17*(1+'Project Description'!H963),0)","v":0},{"$f":"ROUND(P17*(1+'Project Description'!H963),0)","v":0},{"$f":"ROUND(Q17*(1+'Project Description'!H963),0)","v":0},{"$f":"ROUND(R17*(1+'Project Description'!H963),0)","v":0},{"$f":"ROUND(S17*(1+'Project Description'!H963),0)","v":0},{"$f":"ROUND(T17*(1+'Project Description'!H963),0)","v":0},{"$f":"ROUND(U17*(1+'Project Description'!H963),0)","v":0},{"$f":"ROUND(V17*(1+'Project Description'!H963),0)","v":0},{"$f":"ROUND(W17*(1+'Project Description'!H963),0)","v":0},{"$f":"ROUND(X17*(1+'Project Description'!H963),0)","v":0},{"$f":"ROUND(Y17*(1+'Project Description'!H963),0)","v":0},{"$f":"ROUND(Z17*(1+'Project Description'!H963),0)","v":0},{"$f":"ROUND(AA17*(1+'Project Description'!H963),0)","v":0},{"$f":"ROUND(AB17*(1+'Project Description'!H963),0)","v":0},{"$f":"ROUND(AC17*(1+'Project Description'!H963),0)","v":0},{"$f":"ROUND(AD17*(1+'Project Description'!H963),0)","v":0},{"$f":"ROUND(AE17*(1+'Project Description'!H963),0)","v":0},{"$f":"ROUND(AF17*(1+'Project Description'!H963),0)","v":0},{"$f":"ROUND(AG17*(1+'Project Description'!H963),0)","v":0},{"$f":"ROUND(AH17*(1+'Project Description'!H963),0)","v":0},{"$f":"ROUND(AI17*(1+'Project Description'!H963),0)","v":0},{"$f":"ROUND(AJ17*(1+'Project Description'!H963),0)","v":0},{"$f":"ROUND(AK17*(1+'Project Description'!H963),0)","v":0},{"$f":"ROUND(AL17*(1+'Project Description'!H963),0)","v":0},{"$f":"ROUND(AM17*(1+'Project Description'!H963),0)","v":0},{"$f":"ROUND(AN17*(1+'Project Description'!H963),0)","v":0},{"$f":"ROUND(AO17*(1+'Project Description'!H963),0)","v":0}]
[{"$f":"ROW(A18)-A8","v":9},"Laundry",{"$f":"+'Revenues and Expenses'!C13","v":0},{"$f":"ROUND(C18*(1+'Project Description'!H961),0)","v":0},{"$f":"ROUND(D18*(1+'Project Description'!H961),0)","v":0},{"$f":"ROUND(E18*(1+'Project Description'!H963),0)","v":0},{"$f":"ROUND(F18*(1+'Project Description'!H963),0)","v":0},{"$f":"ROUND(G18*(1+'Project Description'!H963),0)","v":0},{"$f":"ROUND(H18*(1+'Project Description'!H963),0)","v":0},{"$f":"ROUND(I18*(1+'Project Description'!H963),0)","v":0},{"$f":"ROUND(J18*(1+'Project Description'!H963),0)","v":0},{"$f":"ROUND(K18*(1+'Project Description'!H963),0)","v":0},{"$f":"ROUND(L18*(1+'Project Description'!H963),0)","v":0},{"$f":"ROUND(M18*(1+'Project Description'!H963),0)","v":0},{"$f":"ROUND(N18*(1+'Project Description'!H963),0)","v":0},{"$f":"ROUND(O18*(1+'Project Description'!H963),0)","v":0},{"$f":"ROUND(P18*(1+'Project Description'!H963),0)","v":0},{"$f":"ROUND(Q18*(1+'Project Description'!H963),0)","v":0},{"$f":"ROUND(R18*(1+'Project Description'!H963),0)","v":0},{"$f":"ROUND(S18*(1+'Project Description'!H963),0)","v":0},{"$f":"ROUND(T18*(1+'Project Description'!H963),0)","v":0},{"$f":"ROUND(U18*(1+'Project Description'!H963),0)","v":0},{"$f":"ROUND(V18*(1+'Project Description'!H963),0)","v":0},{"$f":"ROUND(W18*(1+'Project Description'!H963),0)","v":0},{"$f":"ROUND(X18*(1+'Project Description'!H963),0)","v":0},{"$f":"ROUND(Y18*(1+'Project Description'!H963),0)","v":0},{"$f":"ROUND(Z18*(1+'Project Description'!H963),0)","v":0},{"$f":"ROUND(AA18*(1+'Project Description'!H963),0)","v":0},{"$f":"ROUND(AB18*(1+'Project Description'!H963),0)","v":0},{"$f":"ROUND(AC18*(1+'Project Description'!H963),0)","v":0},{"$f":"ROUND(AD18*(1+'Project Description'!H963),0)","v":0},{"$f":"ROUND(AE18*(1+'Project Description'!H963),0)","v":0},{"$f":"ROUND(AF18*(1+'Project Description'!H963),0)","v":0},{"$f":"ROUND(AG18*(1+'Project Description'!H963),0)","v":0},{"$f":"ROUND(AH18*(1+'Project Description'!H963),0)","v":0},{"$f":"ROUND(AI18*(1+'Project Description'!H963),0)","v":0},{"$f":"ROUND(AJ18*(1+'Project Description'!H963),0)","v":0},{"$f":"ROUND(AK18*(1+'Project Description'!H963),0)","v":0},{"$f":"ROUND(AL18*(1+'Project Description'!H963),0)","v":0},{"$f":"ROUND(AM18*(1+'Project Description'!H963),0)","v":0},{"$f":"ROUND(AN18*(1+'Project Description'!H963),0)","v":0},{"$f":"ROUND(AO18*(1+'Project Description'!H963),0)","v":0}]
[{"$f":"ROW(A19)-A8","v":10},"Parking",{"$f":"+'Revenues and Expenses'!C14","v":0},{"$f":"ROUND(C19*(1+'Project Description'!H961),0)","v":0},{"$f":"ROUND(D19*(1+'Project Description'!H961),0)","v":0},{"$f":"ROUND(E19*(1+'Project Description'!H963),0)","v":0},{"$f":"ROUND(F19*(1+'Project Description'!H963),0)","v":0},{"$f":"ROUND(G19*(1+'Project Description'!H963),0)","v":0},{"$f":"ROUND(H19*(1+'Project Description'!H963),0)","v":0},{"$f":"ROUND(I19*(1+'Project Description'!H963),0)","v":0},{"$f":"ROUND(J19*(1+'Project Description'!H963),0)","v":0},{"$f":"ROUND(K19*(1+'Project Description'!H963),0)","v":0},{"$f":"ROUND(L19*(1+'Project Description'!H963),0)","v":0},{"$f":"ROUND(M19*(1+'Project Description'!H963),0)","v":0},{"$f":"ROUND(N19*(1+'Project Description'!H963),0)","v":0},{"$f":"ROUND(O19*(1+'Project Description'!H963),0)","v":0},{"$f":"ROUND(P19*(1+'Project Description'!H963),0)","v":0},{"$f":"ROUND(Q19*(1+'Project Description'!H963),0)","v":0},{"$f":"ROUND(R19*(1+'Project Description'!H963),0)","v":0},{"$f":"ROUND(S19*(1+'Project Description'!H963),0)","v":0},{"$f":"ROUND(T19*(1+'Project Description'!H963),0)","v":0},{"$f":"ROUND(U19*(1+'Project Description'!H963),0)","v":0},{"$f":"ROUND(V19*(1+'Project Description'!H963),0)","v":0},{"$f":"ROUND(W19*(1+'Project Description'!H963),0)","v":0},{"$f":"ROUND(X19*(1+'Project Description'!H963),0)","v":0},{"$f":"ROUND(Y19*(1+'Project Description'!H963),0)","v":0},{"$f":"ROUND(Z19*(1+'Project Description'!H963),0)","v":0},{"$f":"ROUND(AA19*(1+'Project Description'!H963),0)","v":0},{"$f":"ROUND(AB19*(1+'Project Description'!H963),0)","v":0},{"$f":"ROUND(AC19*(1+'Project Description'!H963),0)","v":0},{"$f":"ROUND(AD19*(1+'Project Description'!H963),0)","v":0},{"$f":"ROUND(AE19*(1+'Project Description'!H963),0)","v":0},{"$f":"ROUND(AF19*(1+'Project Description'!H963),0)","v":0},{"$f":"ROUND(AG19*(1+'Project Description'!H963),0)","v":0},{"$f":"ROUND(AH19*(1+'Project Description'!H963),0)","v":0},{"$f":"ROUND(AI19*(1+'Project Description'!H963),0)","v":0},{"$f":"ROUND(AJ19*(1+'Project Description'!H963),0)","v":0},{"$f":"ROUND(AK19*(1+'Project Description'!H963),0)","v":0},{"$f":"ROUND(AL19*(1+'Project Description'!H963),0)","v":0},{"$f":"ROUND(AM19*(1+'Project Description'!H963),0)","v":0},{"$f":"ROUND(AN19*(1+'Project Description'!H963),0)","v":0},{"$f":"ROUND(AO19*(1+'Project Description'!H963),0)","v":0}]
[{"$f":"ROW(A20)-A8","v":11},"Tenant Charges ",{"$f":"+'Revenues and Expenses'!C15","v":0},{"$f":"ROUND(C20*(1+'Project Description'!H961),0)","v":0},{"$f":"ROUND(D20*(1+'Project Description'!H961),0)","v":0},{"$f":"ROUND(E20*(1+'Project Description'!H963),0)","v":0},{"$f":"ROUND(F20*(1+'Project Description'!H963),0)","v":0},{"$f":"ROUND(G20*(1+'Project Description'!H963),0)","v":0},{"$f":"ROUND(H20*(1+'Project Description'!H963),0)","v":0},{"$f":"ROUND(I20*(1+'Project Description'!H963),0)","v":0},{"$f":"ROUND(J20*(1+'Project Description'!H963),0)","v":0},{"$f":"ROUND(K20*(1+'Project Description'!H963),0)","v":0},{"$f":"ROUND(L20*(1+'Project Description'!H963),0)","v":0},{"$f":"ROUND(M20*(1+'Project Description'!H963),0)","v":0},{"$f":"ROUND(N20*(1+'Project Description'!H963),0)","v":0},{"$f":"ROUND(O20*(1+'Project Description'!H963),0)","v":0},{"$f":"ROUND(P20*(1+'Project Description'!H963),0)","v":0},{"$f":"ROUND(Q20*(1+'Project Description'!H963),0)","v":0},{"$f":"ROUND(R20*(1+'Project Description'!H963),0)","v":0},{"$f":"ROUND(S20*(1+'Project Description'!H963),0)","v":0},{"$f":"ROUND(T20*(1+'Project Description'!H963),0)","v":0},{"$f":"ROUND(U20*(1+'Project Description'!H963),0)","v":0},{"$f":"ROUND(V20*(1+'Project Description'!H963),0)","v":0},{"$f":"ROUND(W20*(1+'Project Description'!H963),0)","v":0},{"$f":"ROUND(X20*(1+'Project Description'!H963),0)","v":0},{"$f":"ROUND(Y20*(1+'Project Description'!H963),0)","v":0},{"$f":"ROUND(Z20*(1+'Project Description'!H963),0)","v":0},{"$f":"ROUND(AA20*(1+'Project Description'!H963),0)","v":0},{"$f":"ROUND(AB20*(1+'Project Description'!H963),0)","v":0},{"$f":"ROUND(AC20*(1+'Project Description'!H963),0)","v":0},{"$f":"ROUND(AD20*(1+'Project Description'!H963),0)","v":0},{"$f":"ROUND(AE20*(1+'Project Description'!H963),0)","v":0},{"$f":"ROUND(AF20*(1+'Project Description'!H963),0)","v":0},{"$f":"ROUND(AG20*(1+'Project Description'!H963),0)","v":0},{"$f":"ROUND(AH20*(1+'Project Description'!H963),0)","v":0},{"$f":"ROUND(AI20*(1+'Project Description'!H963),0)","v":0},{"$f":"ROUND(AJ20*(1+'Project Description'!H963),0)","v":0},{"$f":"ROUND(AK20*(1+'Project Description'!H963),0)","v":0},{"$f":"ROUND(AL20*(1+'Project Description'!H963),0)","v":0},{"$f":"ROUND(AM20*(1+'Project Description'!H963),0)","v":0},{"$f":"ROUND(AN20*(1+'Project Description'!H963),0)","v":0},{"$f":"ROUND(AO20*(1+'Project Description'!H963),0)","v":0}]
[{"$f":"ROW(A21)-A8","v":12},"Other",{"$f":"+'Revenues and Expenses'!C16+SUM('Revenues and Expenses'!C20:C24)","v":0},{"$f":"ROUND(C21*(1+'Project Description'!H961),0)","v":0},{"$f":"ROUND(D21*(1+'Project Description'!H961),0)","v":0},{"$f":"ROUND(E21*(1+'Project Description'!H963),0)","v":0},{"$f":"ROUND(F21*(1+'Project Description'!H963),0)","v":0},{"$f":"ROUND(G21*(1+'Project Description'!H963),0)","v":0},{"$f":"ROUND(H21*(1+'Project Description'!H963),0)","v":0},{"$f":"ROUND(I21*(1+'Project Description'!H963),0)","v":0},{"$f":"ROUND(J21*(1+'Project Description'!H963),0)","v":0},{"$f":"ROUND(K21*(1+'Project Description'!H963),0)","v":0},{"$f":"ROUND(L21*(1+'Project Description'!H963),0)","v":0},{"$f":"ROUND(M21*(1+'Project Description'!H963),0)","v":0},{"$f":"ROUND(N21*(1+'Project Description'!H963),0)","v":0},{"$f":"ROUND(O21*(1+'Project Description'!H963),0)","v":0},{"$f":"ROUND(P21*(1+'Project Description'!H963),0)","v":0},{"$f":"ROUND(Q21*(1+'Project Description'!H963),0)","v":0},{"$f":"ROUND(R21*(1+'Project Description'!H963),0)","v":0},{"$f":"ROUND(S21*(1+'Project Description'!H963),0)","v":0},{"$f":"ROUND(T21*(1+'Project Description'!H963),0)","v":0},{"$f":"ROUND(U21*(1+'Project Description'!H963),0)","v":0},{"$f":"ROUND(V21*(1+'Project Description'!H963),0)","v":0},{"$f":"ROUND(W21*(1+'Project Description'!H963),0)","v":0},{"$f":"ROUND(X21*(1+'Project Description'!H963),0)","v":0},{"$f":"ROUND(Y21*(1+'Project Description'!H963),0)","v":0},{"$f":"ROUND(Z21*(1+'Project Description'!H963),0)","v":0},{"$f":"ROUND(AA21*(1+'Project Description'!H963),0)","v":0},{"$f":"ROUND(AB21*(1+'Project Description'!H963),0)","v":0},{"$f":"ROUND(AC21*(1+'Project Description'!H963),0)","v":0},{"$f":"ROUND(AD21*(1+'Project Description'!H963),0)","v":0},{"$f":"ROUND(AE21*(1+'Project Description'!H963),0)","v":0},{"$f":"ROUND(AF21*(1+'Project Description'!H963),0)","v":0},{"$f":"ROUND(AG21*(1+'Project Description'!H963),0)","v":0},{"$f":"ROUND(AH21*(1+'Project Description'!H963),0)","v":0},{"$f":"ROUND(AI21*(1+'Project Description'!H963),0)","v":0},{"$f":"ROUND(AJ21*(1+'Project Description'!H963),0)","v":0},{"$f":"ROUND(AK21*(1+'Project Description'!H963),0)","v":0},{"$f":"ROUND(AL21*(1+'Project Description'!H963),0)","v":0},{"$f":"ROUND(AM21*(1+'Project Description'!H963),0)","v":0},{"$f":"ROUND(AN21*(1+'Project Description'!H963),0)","v":0},{"$f":"ROUND(AO21*(1+'Project Description'!H963),0)","v":0}]
[{"$f":"ROW(A22)-A8","v":13},"Total Operating Subsidy",{"$f":"SUM('Revenues and Expenses'!C16:C20)","v":0},{"$f":"ROUND(C22*(1+'Project Description'!H961),0)","v":0},{"$f":"ROUND(D22*(1+'Project Description'!H961),0)","v":0},{"$f":"ROUND(E22*(1+'Project Description'!H963),0)","v":0},{"$f":"ROUND(F22*(1+'Project Description'!H963),0)","v":0},{"$f":"ROUND(G22*(1+'Project Description'!H963),0)","v":0},{"$f":"ROUND(H22*(1+'Project Description'!H963),0)","v":0},{"$f":"ROUND(I22*(1+'Project Description'!H963),0)","v":0},{"$f":"ROUND(J22*(1+'Project Description'!H963),0)","v":0},{"$f":"ROUND(K22*(1+'Project Description'!H963),0)","v":0},{"$f":"ROUND(L22*(1+'Project Description'!H963),0)","v":0},{"$f":"ROUND(M22*(1+'Project Description'!H963),0)","v":0},{"$f":"ROUND(N22*(1+'Project Description'!H963),0)","v":0},{"$f":"ROUND(O22*(1+'Project Description'!H963),0)","v":0},{"$f":"ROUND(P22*(1+'Project Description'!H963),0)","v":0},{"$f":"ROUND(Q22*(1+'Project Description'!H963),0)","v":0},{"$f":"ROUND(R22*(1+'Project Description'!H963),0)","v":0},{"$f":"ROUND(S22*(1+'Project Description'!H963),0)","v":0},{"$f":"ROUND(T22*(1+'Project Description'!H963),0)","v":0},{"$f":"ROUND(U22*(1+'Project Description'!H963),0)","v":0},{"$f":"ROUND(V22*(1+'Project Description'!H963),0)","v":0},{"$f":"ROUND(W22*(1+'Project Description'!H963),0)","v":0},{"$f":"ROUND(X22*(1+'Project Description'!H963),0)","v":0},{"$f":"ROUND(Y22*(1+'Project Description'!H963),0)","v":0},{"$f":"ROUND(Z22*(1+'Project Description'!H963),0)","v":0},{"$f":"ROUND(AA22*(1+'Project Description'!H963),0)","v":0},{"$f":"ROUND(AB22*(1+'Project Description'!H963),0)","v":0},{"$f":"ROUND(AC22*(1+'Project Description'!H963),0)","v":0},{"$f":"ROUND(AD22*(1+'Project Description'!H963),0)","v":0},{"$f":"ROUND(AE22*(1+'Project Description'!H963),0)","v":0},{"$f":"ROUND(AF22*(1+'Project Description'!H963),0)","v":0},{"$f":"ROUND(AG22*(1+'Project Description'!H963),0)","v":0},{"$f":"ROUND(AH22*(1+'Project Description'!H963),0)","v":0},{"$f":"ROUND(AI22*(1+'Project Description'!H963),0)","v":0},{"$f":"ROUND(AJ22*(1+'Project Description'!H963),0)","v":0},{"$f":"ROUND(AK22*(1+'Project Description'!H963),0)","v":0},{"$f":"ROUND(AL22*(1+'Project Description'!H963),0)","v":0},{"$f":"ROUND(AM22*(1+'Project Description'!H963),0)","v":0},{"$f":"ROUND(AN22*(1+'Project Description'!H963),0)","v":0},{"$f":"ROUND(AO22*(1+'Project Description'!H963),0)","v":0}]
[{"$f":"ROW(A23)-A8","v":14}]
[{"$f":"ROW(A24)-A8","v":15},"Effective Gross Income",{"$f":"SUM(C13:C23)","v":0},{"$f":"SUM(D13:D23)","v":0},0,0,0,0,0,0,0,0,0,0,0,0,0,0,0,0,0,0,0,0,0,0,0,0,0,0,0,0,0,0,0,0,0,{"$f":"SUM(AL13:AL23)","v":0},{"$f":"SUM(AM13:AM23)","v":0},{"$f":"SUM(AN13:AN23)","v":0},{"$f":"SUM(AO13:AO23)","v":0},{"$f":"SUM(AP13:AP23)","v":0}]
[{"$f":"ROW(A25)-A8","v":16}]
[{"$f":"ROW(A26)-A8","v":17},"Property Management Fee @ 2% Trend",{"$f":"+'Revenues and Expenses'!C42","v":0},{"$f":"ROUND(C26*(1+'Project Description'!$H$961),0)","v":0},{"$f":"ROUND(D26*(1+'Project Description'!$H$961),0)","v":0},{"$f":"ROUND(E26*(1+'Project Description'!$H$961),0)","v":0},{"$f":"ROUND(F26*(1+'Project Description'!$H$961),0)","v":0},{"$f":"ROUND(G26*(1+'Project Description'!$H$961),0)","v":0},{"$f":"ROUND(H26*(1+'Project Description'!$H$961),0)","v":0},{"$f":"ROUND(I26*(1+'Project Description'!$H$961),0)","v":0},{"$f":"ROUND(J26*(1+'Project Description'!$H$961),0)","v":0},{"$f":"ROUND(K26*(1+'Project Description'!$H$961),0)","v":0},{"$f":"ROUND(L26*(1+'Project Description'!$H$961),0)","v":0},{"$f":"ROUND(M26*(1+'Project Description'!$H$961),0)","v":0},{"$f":"ROUND(N26*(1+'Project Description'!$H$961),0)","v":0},{"$f":"ROUND(O26*(1+'Project Description'!$H$961),0)","v":0},{"$f":"ROUND(P26*(1+'Project Description'!$H$961),0)","v":0},{"$f":"ROUND(Q26*(1+'Project Description'!$H$967),0)","v":0},{"$f":"ROUND(R26*(1+'Project Description'!$H$967),0)","v":0},{"$f":"ROUND(S26*(1+'Project Description'!$H$967),0)","v":0},{"$f":"ROUND(T26*(1+'Project Description'!$H$967),0)","v":0},{"$f":"ROUND(U26*(1+'Project Description'!$H$967),0)","v":0},{"$f":"ROUND(V26*(1+'Project Description'!$H$967),0)","v":0},{"$f":"ROUND(W26*(1+'Project Description'!$H$967),0)","v":0},{"$f":"ROUND(X26*(1+'Project Description'!$H$967),0)","v":0},{"$f":"ROUND(Y26*(1+'Project Description'!$H$967),0)","v":0},{"$f":"ROUND(Z26*(1+'Project Description'!$H$967),0)","v":0},{"$f":"ROUND(AA26*(1+'Project Description'!$H$967),0)","v":0},{"$f":"ROUND(AB26*(1+'Project Description'!$H$967),0)","v":0},{"$f":"ROUND(AC26*(1+'Project Description'!$H$967),0)","v":0},{"$f":"ROUND(AD26*(1+'Project Description'!$H$967),0)","v":0},{"$f":"ROUND(AE26*(1+'Project Description'!$H$967),0)","v":0},{"$f":"ROUND(AF26*(1+'Project Description'!$H$967),0)","v":0},{"$f":"ROUND(AG26*(1+'Project Description'!$H$967),0)","v":0},{"$f":"ROUND(AH26*(1+'Project Description'!$H$967),0)","v":0},{"$f":"ROUND(AI26*(1+'Project Description'!$H$967),0)","v":0},{"$f":"ROUND(AJ26*(1+'Project Description'!$H$967),0)","v":0},{"$f":"ROUND(AK26*(1+'Project Description'!$H$967),0)","v":0},{"$f":"ROUND(AL26*(1+'Project Description'!$H$967),0)","v":0},{"$f":"ROUND(AM26*(1+'Project Description'!$H$967),0)","v":0},{"$f":"ROUND(AN26*(1+'Project Description'!$H$967),0)","v":0},{"$f":"ROUND(AO26*(1+'Project Description'!$H$967),0)","v":0}]
[{"$f":"ROW(A27)-A8","v":18},"LHC Compliance Monitoring Fee",{"$f":"+'Revenues and Expenses'!C37","v":0},{"$f":"ROUND(C27*(1+'Project Description'!H967),0)","v":0},{"$f":"ROUND(D27*(1+'Project Description'!H967),0)","v":0},{"$f":"ROUND(E27*(1+'Project Description'!H967),0)","v":0},{"$f":"ROUND(F27*(1+'Project Description'!H967),0)","v":0},{"$f":"ROUND(G27*(1+'Project Description'!H967),0)","v":0},{"$f":"ROUND(H27*(1+'Project Description'!H967),0)","v":0},{"$f":"ROUND(I27*(1+'Project Description'!H967),0)","v":0},{"$f":"ROUND(J27*(1+'Project Description'!H967),0)","v":0},{"$f":"ROUND(K27*(1+'Project Description'!H967),0)","v":0},{"$f":"ROUND(L27*(1+'Project Description'!H967),0)","v":0},{"$f":"ROUND(M27*(1+'Project Description'!H967),0)","v":0},{"$f":"ROUND(N27*(1+'Project Description'!H967),0)","v":0},{"$f":"ROUND(O27*(1+'Project Description'!H967),0)","v":0},{"$f":"ROUND(P27*(1+'Project Description'!H967),0)","v":0},{"$f":"ROUND(Q27*(1+'Project Description'!H967),0)","v":0},{"$f":"ROUND(R27*(1+'Project Description'!H967),0)","v":0},{"$f":"ROUND(S27*(1+'Project Description'!H967),0)","v":0},{"$f":"ROUND(T27*(1+'Project Description'!H967),0)","v":0},{"$f":"ROUND(U27*(1+'Project Description'!H967),0)","v":0},{"$f":"ROUND(V27*(1+'Project Description'!H967),0)","v":0},{"$f":"ROUND(W27*(1+'Project Description'!H967),0)","v":0},{"$f":"ROUND(X27*(1+'Project Description'!H967),0)","v":0},{"$f":"ROUND(Y27*(1+'Project Description'!H967),0)","v":0},{"$f":"ROUND(Z27*(1+'Project Description'!H967),0)","v":0},{"$f":"ROUND(AA27*(1+'Project Description'!H967),0)","v":0},{"$f":"ROUND(AB27*(1+'Project Description'!H967),0)","v":0},{"$f":"ROUND(AC27*(1+'Project Description'!H967),0)","v":0},{"$f":"ROUND(AD27*(1+'Project Description'!H967),0)","v":0},{"$f":"ROUND(AE27*(1+'Project Description'!H967),0)","v":0},{"$f":"ROUND(AF27*(1+'Project Description'!H967),0)","v":0},{"$f":"ROUND(AG27*(1+'Project Description'!H967),0)","v":0},{"$f":"ROUND(AH27*(1+'Project Description'!H967),0)","v":0},{"$f":"ROUND(AI27*(1+'Project Description'!H967),0)","v":0},{"$f":"ROUND(AJ27*(1+'Project Description'!H967),0)","v":0},{"$f":"ROUND(AK27*(1+'Project Description'!H967),0)","v":0},{"$f":"ROUND(AL27*(1+'Project Description'!H967),0)","v":0},{"$f":"ROUND(AM27*(1+'Project Description'!H967),0)","v":0},{"$f":"ROUND(AN27*(1+'Project Description'!H967),0)","v":0},{"$f":"ROUND(AO27*(1+'Project Description'!H967),0)","v":0}]
[{"$f":"ROW(A28)-A8","v":19},"Asset Management Fee",{"$f":"+'Revenues and Expenses'!C39","v":0},{"$f":"ROUND(C28*(1+'Project Description'!H967),0)","v":0},{"$f":"ROUND(D28*(1+'Project Description'!H967),0)","v":0},{"$f":"ROUND(E28*(1+'Project Description'!H967),0)","v":0},{"$f":"ROUND(F28*(1+'Project Description'!H967),0)","v":0},{"$f":"ROUND(G28*(1+'Project Description'!H967),0)","v":0},{"$f":"ROUND(H28*(1+'Project Description'!H967),0)","v":0},{"$f":"ROUND(I28*(1+'Project Description'!H967),0)","v":0},{"$f":"ROUND(J28*(1+'Project Description'!H967),0)","v":0},{"$f":"ROUND(K28*(1+'Project Description'!H967),0)","v":0},{"$f":"ROUND(L28*(1+'Project Description'!H967),0)","v":0},{"$f":"ROUND(M28*(1+'Project Description'!H967),0)","v":0},{"$f":"ROUND(N28*(1+'Project Description'!H967),0)","v":0},{"$f":"ROUND(O28*(1+'Project Description'!H967),0)","v":0},{"$f":"ROUND(P28*(1+'Project Description'!H967),0)","v":0},{"$f":"ROUND(Q28*(1+'Project Description'!H967),0)","v":0},{"$f":"ROUND(R28*(1+'Project Description'!H967),0)","v":0},{"$f":"ROUND(S28*(1+'Project Description'!H967),0)","v":0},{"$f":"ROUND(T28*(1+'Project Description'!H967),0)","v":0},{"$f":"ROUND(U28*(1+'Project Description'!H967),0)","v":0},{"$f":"ROUND(V28*(1+'Project Description'!H967),0)","v":0},{"$f":"ROUND(W28*(1+'Project Description'!H967),0)","v":0},{"$f":"ROUND(X28*(1+'Project Description'!H967),0)","v":0},{"$f":"ROUND(Y28*(1+'Project Description'!H967),0)","v":0},{"$f":"ROUND(Z28*(1+'Project Description'!H967),0)","v":0},{"$f":"ROUND(AA28*(1+'Project Description'!H967),0)","v":0},{"$f":"ROUND(AB28*(1+'Project Description'!H967),0)","v":0},{"$f":"ROUND(AC28*(1+'Project Description'!H967),0)","v":0},{"$f":"ROUND(AD28*(1+'Project Description'!H967),0)","v":0},{"$f":"ROUND(AE28*(1+'Project Description'!H967),0)","v":0},{"$f":"ROUND(AF28*(1+'Project Description'!H967),0)","v":0},{"$f":"ROUND(AG28*(1+'Project Description'!H967),0)","v":0},{"$f":"ROUND(AH28*(1+'Project Description'!H967),0)","v":0},{"$f":"ROUND(AI28*(1+'Project Description'!H967),0)","v":0},{"$f":"ROUND(AJ28*(1+'Project Description'!H967),0)","v":0},{"$f":"ROUND(AK28*(1+'Project Description'!H967),0)","v":0},{"$f":"ROUND(AL28*(1+'Project Description'!H967),0)","v":0},{"$f":"ROUND(AM28*(1+'Project Description'!H967),0)","v":0},{"$f":"ROUND(AN28*(1+'Project Description'!H967),0)","v":0},{"$f":"ROUND(AO28*(1+'Project Description'!H967),0)","v":0}]
[{"$f":"ROW(A29)-A8","v":20},"Other Administrative Expenses",{"$f":"'Revenues and Expenses'!C31-SUM(Proforma!C25:C28)","v":0},{"$f":"ROUND(C29*(1+'Project Description'!H967),0)","v":0},{"$f":"ROUND(D29*(1+'Project Description'!H967),0)","v":0},{"$f":"ROUND(E29*(1+'Project Description'!H967),0)","v":0},{"$f":"ROUND(F29*(1+'Project Description'!H967),0)","v":0},{"$f":"ROUND(G29*(1+'Project Description'!H967),0)","v":0},{"$f":"ROUND(H29*(1+'Project Description'!H967),0)","v":0},{"$f":"ROUND(I29*(1+'Project Description'!H967),0)","v":0},{"$f":"ROUND(J29*(1+'Project Description'!H967),0)","v":0},{"$f":"ROUND(K29*(1+'Project Description'!H967),0)","v":0},{"$f":"ROUND(L29*(1+'Project Description'!H967),0)","v":0},{"$f":"ROUND(M29*(1+'Project Description'!H967),0)","v":0},{"$f":"ROUND(N29*(1+'Project Description'!H967),0)","v":0},{"$f":"ROUND(O29*(1+'Project Description'!H967),0)","v":0},{"$f":"ROUND(P29*(1+'Project Description'!H967),0)","v":0},{"$f":"ROUND(Q29*(1+'Project Description'!H967),0)","v":0},{"$f":"ROUND(R29*(1+'Project Description'!H967),0)","v":0},{"$f":"ROUND(S29*(1+'Project Description'!H967),0)","v":0},{"$f":"ROUND(T29*(1+'Project Description'!H967),0)","v":0},{"$f":"ROUND(U29*(1+'Project Description'!H967),0)","v":0},{"$f":"ROUND(V29*(1+'Project Description'!H967),0)","v":0},{"$f":"ROUND(W29*(1+'Project Description'!H967),0)","v":0},{"$f":"ROUND(X29*(1+'Project Description'!H967),0)","v":0},{"$f":"ROUND(Y29*(1+'Project Description'!H967),0)","v":0},{"$f":"ROUND(Z29*(1+'Project Description'!H967),0)","v":0},{"$f":"ROUND(AA29*(1+'Project Description'!H967),0)","v":0},{"$f":"ROUND(AB29*(1+'Project Description'!H967),0)","v":0},{"$f":"ROUND(AC29*(1+'Project Description'!H967),0)","v":0},{"$f":"ROUND(AD29*(1+'Project Description'!H967),0)","v":0},{"$f":"ROUND(AE29*(1+'Project Description'!H967),0)","v":0},{"$f":"ROUND(AF29*(1+'Project Description'!H967),0)","v":0},{"$f":"ROUND(AG29*(1+'Project Description'!H967),0)","v":0},{"$f":"ROUND(AH29*(1+'Project Description'!H967),0)","v":0},{"$f":"ROUND(AI29*(1+'Project Description'!H967),0)","v":0},{"$f":"ROUND(AJ29*(1+'Project Description'!H967),0)","v":0},{"$f":"ROUND(AK29*(1+'Project Description'!H967),0)","v":0},{"$f":"ROUND(AL29*(1+'Project Description'!H967),0)","v":0},{"$f":"ROUND(AM29*(1+'Project Description'!H967),0)","v":0},{"$f":"ROUND(AN29*(1+'Project Description'!H967),0)","v":0},{"$f":"ROUND(AO29*(1+'Project Description'!H967),0)","v":0}]
[{"$f":"ROW(A30)-A8","v":21},"Operating & Maintenance Expenses",{"$f":"+'Revenues and Expenses'!C52","v":0},{"$f":"ROUND(C30*(1+'Project Description'!H967),0)","v":0},{"$f":"ROUND(D30*(1+'Project Description'!H967),0)","v":0},{"$f":"ROUND(E30*(1+'Project Description'!H967),0)","v":0},{"$f":"ROUND(F30*(1+'Project Description'!H967),0)","v":0},{"$f":"ROUND(G30*(1+'Project Description'!H967),0)","v":0},{"$f":"ROUND(H30*(1+'Project Description'!H967),0)","v":0},{"$f":"ROUND(I30*(1+'Project Description'!H967),0)","v":0},{"$f":"ROUND(J30*(1+'Project Description'!H967),0)","v":0},{"$f":"ROUND(K30*(1+'Project Description'!H967),0)","v":0},{"$f":"ROUND(L30*(1+'Project Description'!H967),0)","v":0},{"$f":"ROUND(M30*(1+'Project Description'!H967),0)","v":0},{"$f":"ROUND(N30*(1+'Project Description'!H967),0)","v":0},{"$f":"ROUND(O30*(1+'Project Description'!H967),0)","v":0},{"$f":"ROUND(P30*(1+'Project Description'!H967),0)","v":0},{"$f":"ROUND(Q30*(1+'Project Description'!H967),0)","v":0},{"$f":"ROUND(R30*(1+'Project Description'!H967),0)","v":0},{"$f":"ROUND(S30*(1+'Project Description'!H967),0)","v":0},{"$f":"ROUND(T30*(1+'Project Description'!H967),0)","v":0},{"$f":"ROUND(U30*(1+'Project Description'!H967),0)","v":0},{"$f":"ROUND(V30*(1+'Project Description'!H967),0)","v":0},{"$f":"ROUND(W30*(1+'Project Description'!H967),0)","v":0},{"$f":"ROUND(X30*(1+'Project Description'!H967),0)","v":0},{"$f":"ROUND(Y30*(1+'Project Description'!H967),0)","v":0},{"$f":"ROUND(Z30*(1+'Project Description'!H967),0)","v":0},{"$f":"ROUND(AA30*(1+'Project Description'!H967),0)","v":0},{"$f":"ROUND(AB30*(1+'Project Description'!H967),0)","v":0},{"$f":"ROUND(AC30*(1+'Project Description'!H967),0)","v":0},{"$f":"ROUND(AD30*(1+'Project Description'!H967),0)","v":0},{"$f":"ROUND(AE30*(1+'Project Description'!H967),0)","v":0},{"$f":"ROUND(AF30*(1+'Project Description'!H967),0)","v":0},{"$f":"ROUND(AG30*(1+'Project Description'!H967),0)","v":0},{"$f":"ROUND(AH30*(1+'Project Description'!H967),0)","v":0},{"$f":"ROUND(AI30*(1+'Project Description'!H967),0)","v":0},{"$f":"ROUND(AJ30*(1+'Project Description'!H967),0)","v":0},{"$f":"ROUND(AK30*(1+'Project Description'!H967),0)","v":0},{"$f":"ROUND(AL30*(1+'Project Description'!H967),0)","v":0},{"$f":"ROUND(AM30*(1+'Project Description'!H967),0)","v":0},{"$f":"ROUND(AN30*(1+'Project Description'!H967),0)","v":0},{"$f":"ROUND(AO30*(1+'Project Description'!H967),0)","v":0}]
[{"$f":"ROW(A31)-A8","v":22},"Utilities Expenses",{"$f":"+'Revenues and Expenses'!C64","v":0},{"$f":"ROUND(C31*(1+'Project Description'!H967),0)","v":0},{"$f":"ROUND(D31*(1+'Project Description'!H967),0)","v":0},{"$f":"ROUND(E31*(1+'Project Description'!H967),0)","v":0},{"$f":"ROUND(F31*(1+'Project Description'!H967),0)","v":0},{"$f":"ROUND(G31*(1+'Project Description'!H967),0)","v":0},{"$f":"ROUND(H31*(1+'Project Description'!H967),0)","v":0},{"$f":"ROUND(I31*(1+'Project Description'!H967),0)","v":0},{"$f":"ROUND(J31*(1+'Project Description'!H967),0)","v":0},{"$f":"ROUND(K31*(1+'Project Description'!H967),0)","v":0},{"$f":"ROUND(L31*(1+'Project Description'!H967),0)","v":0},{"$f":"ROUND(M31*(1+'Project Description'!H967),0)","v":0},{"$f":"ROUND(N31*(1+'Project Description'!H967),0)","v":0},{"$f":"ROUND(O31*(1+'Project Description'!H967),0)","v":0},{"$f":"ROUND(P31*(1+'Project Description'!H967),0)","v":0},{"$f":"ROUND(Q31*(1+'Project Description'!H967),0)","v":0},{"$f":"ROUND(R31*(1+'Project Description'!H967),0)","v":0},{"$f":"ROUND(S31*(1+'Project Description'!H967),0)","v":0},{"$f":"ROUND(T31*(1+'Project Description'!H967),0)","v":0},{"$f":"ROUND(U31*(1+'Project Description'!H967),0)","v":0},{"$f":"ROUND(V31*(1+'Project Description'!H967),0)","v":0},{"$f":"ROUND(W31*(1+'Project Description'!H967),0)","v":0},{"$f":"ROUND(X31*(1+'Project Description'!H967),0)","v":0},{"$f":"ROUND(Y31*(1+'Project Description'!H967),0)","v":0},{"$f":"ROUND(Z31*(1+'Project Description'!H967),0)","v":0},{"$f":"ROUND(AA31*(1+'Project Description'!H967),0)","v":0},{"$f":"ROUND(AB31*(1+'Project Description'!H967),0)","v":0},{"$f":"ROUND(AC31*(1+'Project Description'!H967),0)","v":0},{"$f":"ROUND(AD31*(1+'Project Description'!H967),0)","v":0},{"$f":"ROUND(AE31*(1+'Project Description'!H967),0)","v":0},{"$f":"ROUND(AF31*(1+'Project Description'!H967),0)","v":0},{"$f":"ROUND(AG31*(1+'Project Description'!H967),0)","v":0},{"$f":"ROUND(AH31*(1+'Project Description'!H967),0)","v":0},{"$f":"ROUND(AI31*(1+'Project Description'!H967),0)","v":0},{"$f":"ROUND(AJ31*(1+'Project Description'!H967),0)","v":0},{"$f":"ROUND(AK31*(1+'Project Description'!H967),0)","v":0},{"$f":"ROUND(AL31*(1+'Project Description'!H967),0)","v":0},{"$f":"ROUND(AM31*(1+'Project Description'!H967),0)","v":0},{"$f":"ROUND(AN31*(1+'Project Description'!H967),0)","v":0},{"$f":"ROUND(AO31*(1+'Project Description'!H967),0)","v":0}]
[{"$f":"ROW(A32)-A8","v":23},"Taxes & Insurance Expenses",{"$f":"+'Revenues and Expenses'!C89-SUM(Proforma!C25:C31)","v":0},{"$f":"ROUND(C32*(1+'Project Description'!H967),0)","v":0},{"$f":"ROUND(D32*(1+'Project Description'!H967),0)","v":0},{"$f":"ROUND(E32*(1+'Project Description'!H967),0)","v":0},{"$f":"ROUND(F32*(1+'Project Description'!H967),0)","v":0},{"$f":"ROUND(G32*(1+'Project Description'!H967),0)","v":0},{"$f":"ROUND(H32*(1+'Project Description'!H967),0)","v":0},{"$f":"ROUND(I32*(1+'Project Description'!H967),0)","v":0},{"$f":"ROUND(J32*(1+'Project Description'!H967),0)","v":0},{"$f":"ROUND(K32*(1+'Project Description'!H967),0)","v":0},{"$f":"ROUND(L32*(1+'Project Description'!H967),0)","v":0},{"$f":"ROUND(M32*(1+'Project Description'!H967),0)","v":0},{"$f":"ROUND(N32*(1+'Project Description'!H967),0)","v":0},{"$f":"ROUND(O32*(1+'Project Description'!H967),0)","v":0},{"$f":"ROUND(P32*(1+'Project Description'!H967),0)","v":0},{"$f":"ROUND(Q32*(1+'Project Description'!H967),0)","v":0},{"$f":"ROUND(R32*(1+'Project Description'!H967),0)","v":0},{"$f":"ROUND(S32*(1+'Project Description'!H967),0)","v":0},{"$f":"ROUND(T32*(1+'Project Description'!H967),0)","v":0},{"$f":"ROUND(U32*(1+'Project Description'!H967),0)","v":0},{"$f":"ROUND(V32*(1+'Project Description'!H967),0)","v":0},{"$f":"ROUND(W32*(1+'Project Description'!H967),0)","v":0},{"$f":"ROUND(X32*(1+'Project Description'!H967),0)","v":0},{"$f":"ROUND(Y32*(1+'Project Description'!H967),0)","v":0},{"$f":"ROUND(Z32*(1+'Project Description'!H967),0)","v":0},{"$f":"ROUND(AA32*(1+'Project Description'!H967),0)","v":0},{"$f":"ROUND(AB32*(1+'Project Description'!H967),0)","v":0},{"$f":"ROUND(AC32*(1+'Project Description'!H967),0)","v":0},{"$f":"ROUND(AD32*(1+'Project Description'!H967),0)","v":0},{"$f":"ROUND(AE32*(1+'Project Description'!H967),0)","v":0},{"$f":"ROUND(AF32*(1+'Project Description'!H967),0)","v":0},{"$f":"ROUND(AG32*(1+'Project Description'!H967),0)","v":0},{"$f":"ROUND(AH32*(1+'Project Description'!H967),0)","v":0},{"$f":"ROUND(AI32*(1+'Project Description'!H967),0)","v":0},{"$f":"ROUND(AJ32*(1+'Project Description'!H967),0)","v":0},{"$f":"ROUND(AK32*(1+'Project Description'!H967),0)","v":0},{"$f":"ROUND(AL32*(1+'Project Description'!H967),0)","v":0},{"$f":"ROUND(AM32*(1+'Project Description'!H967),0)","v":0},{"$f":"ROUND(AN32*(1+'Project Description'!H967),0)","v":0},{"$f":"ROUND(AO32*(1+'Project Description'!H967),0)","v":0}]
[{"$f":"ROW(A33)-A8","v":24}]
[{"$f":"ROW(A34)-A8","v":25},"Total Operating Expenses",{"$f":"SUM(C25:C32)","v":0},{"$f":"SUM(D25:D32)","v":0},0,0,0,0,0,0,0,0,0,0,0,0,0,0,0,0,0,0,0,0,0,0,0,0,0,0,0,0,0,0,0,0,0,{"$f":"SUM(AL25:AL32)","v":0},{"$f":"SUM(AM25:AM32)","v":0},{"$f":"SUM(AN25:AN32)","v":0},{"$f":"SUM(AO25:AO32)","v":0},{"$f":"SUM(AP25:AP32)","v":0}]
[{"$f":"ROW(A35)-A8","v":26}]
[{"$f":"ROW(A36)-A8","v":27},"Replacement Reserve ADRR",{"$f":"+'Project Description'!H987","v":0},{"$f":"ROUND(C36*(1+'Project Description'!H971),0)","v":0},{"$f":"ROUND(D36*(1+'Project Description'!H971),0)","v":0},{"$f":"ROUND(E36*(1+'Project Description'!H971),0)","v":0},{"$f":"ROUND(F36*(1+'Project Description'!H971),0)","v":0},{"$f":"ROUND(G36*(1+'Project Description'!H971),0)","v":0},{"$f":"ROUND(H36*(1+'Project Description'!H971),0)","v":0},{"$f":"ROUND(I36*(1+'Project Description'!H971),0)","v":0},{"$f":"ROUND(J36*(1+'Project Description'!H971),0)","v":0},{"$f":"ROUND(K36*(1+'Project Description'!H971),0)","v":0},{"$f":"ROUND(L36*(1+'Project Description'!H971),0)","v":0},{"$f":"ROUND(M36*(1+'Project Description'!H971),0)","v":0},{"$f":"ROUND(N36*(1+'Project Description'!H971),0)","v":0},{"$f":"ROUND(O36*(1+'Project Description'!H971),0)","v":0},{"$f":"ROUND(P36*(1+'Project Description'!H971),0)","v":0},{"$f":"ROUND(Q36*(1+'Project Description'!H971),0)","v":0},{"$f":"ROUND(R36*(1+'Project Description'!H971),0)","v":0},{"$f":"ROUND(S36*(1+'Project Description'!H971),0)","v":0},{"$f":"ROUND(T36*(1+'Project Description'!H971),0)","v":0},{"$f":"ROUND(U36*(1+'Project Description'!H971),0)","v":0},{"$f":"ROUND(V36*(1+'Project Description'!H971),0)","v":0},{"$f":"ROUND(W36*(1+'Project Description'!H971),0)","v":0},{"$f":"ROUND(X36*(1+'Project Description'!H971),0)","v":0},{"$f":"ROUND(Y36*(1+'Project Description'!H971),0)","v":0},{"$f":"ROUND(Z36*(1+'Project Description'!H971),0)","v":0},{"$f":"ROUND(AA36*(1+'Project Description'!H971),0)","v":0},{"$f":"ROUND(AB36*(1+'Project Description'!H971),0)","v":0},{"$f":"ROUND(AC36*(1+'Project Description'!H971),0)","v":0},{"$f":"ROUND(AD36*(1+'Project Description'!H971),0)","v":0},{"$f":"ROUND(AE36*(1+'Project Description'!H971),0)","v":0},{"$f":"ROUND(AF36*(1+'Project Description'!H971),0)","v":0},{"$f":"ROUND(AG36*(1+'Project Description'!H971),0)","v":0},{"$f":"ROUND(AH36*(1+'Project Description'!H971),0)","v":0},{"$f":"ROUND(AI36*(1+'Project Description'!H971),0)","v":0},{"$f":"ROUND(AJ36*(1+'Project Description'!H971),0)","v":0},{"$f":"ROUND(AK36*(1+'Project Description'!H971),0)","v":0},{"$f":"ROUND(AL36*(1+'Project Description'!H971),0)","v":0},{"$f":"ROUND(AM36*(1+'Project Description'!H971),0)","v":0},{"$f":"ROUND(AN36*(1+'Project Description'!H971),0)","v":0},{"$f":"ROUND(AO36*(1+'Project Description'!H971),0)","v":0}]
[{"$f":"ROW(A37)-A8","v":28}]
[{"$f":"ROW(A38)-A8","v":29},"Net Operating Income",{"$f":"+C24-C34-C36","v":0},{"$f":"+D24-D34-D36","v":0},0,0,0,0,0,0,0,0,0,0,0,0,0,0,0,0,0,0,0,0,0,0,0,0,0,0,0,0,0,0,0,0,0,{"$f":"+AL24-AL34-AL36","v":0},{"$f":"+AM24-AM34-AM36","v":0},{"$f":"+AN24-AN34-AN36","v":0},{"$f":"+AO24-AO34-AO36","v":0},{"$f":"+AP24-AP34-AP36","v":0}]
[{"$f":"ROW(A39)-A8","v":30}]
[{"$f":"ROW(A40)-A8","v":31},"Must Pay Debt Service",{"$f":"+'Project Description'!H994","v":0},{"$f":"+C40","v":0},{"$f":"+D40","v":0},0,0,0,0,0,0,0,0,0,0,0,0,0,0,0,0,0,0,0,0,0,0,0,0,0,0,0,0,0,0,0,0,{"$f":"+AK40","v":0},{"$f":"+AL40","v":0},{"$f":"+AM40","v":0},{"$f":"+AN40","v":0},{"$f":"+AO40","v":0}]
[{"$f":"ROW(A41)-A8","v":32},"Other"]
[{"$f":"ROW(A42)-A8","v":33}]
[{"$f":"ROW(A43)-A8","v":34},"Operating Cash Flow",{"$f":"C38-SUM(C39:C42)","v":0},{"$f":"D38-SUM(D39:D42)","v":0},0,0,0,0,0,0,0,0,0,0,0,0,0,0,0,0,0,0,0,0,0,0,0,0,0,0,0,0,0,0,0,0,0,{"$f":"AL38-SUM(AL39:AL42)","v":0},{"$f":"AM38-SUM(AM39:AM42)","v":0},{"$f":"AN38-SUM(AN39:AN42)","v":0},{"$f":"AO38-SUM(AO39:AO42)","v":0},{"$f":"AP38-SUM(AP39:AP42)","v":0}]
[{"$f":"ROW(A44)-A8","v":35},"DSCR",{"$f":"IF(SUM(C40:C41)=0,0,C38/SUM(C40:C41))","v":0},{"$f":"IF(SUM(D40:D41)=0,0,D38/SUM(D40:D41))","v":0},0,0,0,0,0,0,0,0,0,0,0,0,0,0,0,0,0,0,0,0,0,0,0,0,0,0,0,0,0,0,0,0,0,{"$f":"IF(SUM(AL40:AL41)=0,0,AL38/SUM(AL40:AL41))","v":0},{"$f":"IF(SUM(AM40:AM41)=0,0,AM38/SUM(AM40:AM41))","v":0},{"$f":"IF(SUM(AN40:AN41)=0,0,AN38/SUM(AN40:AN41))","v":0},{"$f":"IF(SUM(AO40:AO41)=0,0,AO38/SUM(AO40:AO41))","v":0},{"$f":"IF(SUM(AP40:AP41)=0,0,AP38/SUM(AP40:AP41))","v":0}]
[{"$f":"ROW(A45)-A8","v":36}]
[null,"Allowable Contingent A/M Fee",{"$f":"+'Revenues and Expenses'!J105","v":0},{"$f":"ROUND(C46*(1+'Project Description'!H967),0)","v":0},{"$f":"ROUND(D46*(1+'Project Description'!H967),0)","v":0},{"$f":"ROUND(E46*(1+'Project Description'!H967),0)","v":0},{"$f":"ROUND(F46*(1+'Project Description'!H967),0)","v":0},{"$f":"ROUND(G46*(1+'Project Description'!H967),0)","v":0},{"$f":"ROUND(H46*(1+'Project Description'!H967),0)","v":0},{"$f":"ROUND(I46*(1+'Project Description'!H967),0)","v":0},{"$f":"ROUND(J46*(1+'Project Description'!H967),0)","v":0},{"$f":"ROUND(K46*(1+'Project Description'!H967),0)","v":0},{"$f":"ROUND(L46*(1+'Project Description'!H967),0)","v":0},{"$f":"ROUND(M46*(1+'Project Description'!H967),0)","v":0},{"$f":"ROUND(N46*(1+'Project Description'!H967),0)","v":0},{"$f":"ROUND(O46*(1+'Project Description'!H967),0)","v":0},{"$f":"ROUND(P46*(1+'Project Description'!H967),0)","v":0},{"$f":"ROUND(Q46*(1+'Project Description'!H967),0)","v":0},{"$f":"ROUND(R46*(1+'Project Description'!H967),0)","v":0},{"$f":"ROUND(S46*(1+'Project Description'!H967),0)","v":0},{"$f":"ROUND(T46*(1+'Project Description'!H967),0)","v":0},{"$f":"ROUND(U46*(1+'Project Description'!H967),0)","v":0},{"$f":"ROUND(V46*(1+'Project Description'!H967),0)","v":0},{"$f":"ROUND(W46*(1+'Project Description'!H967),0)","v":0},{"$f":"ROUND(X46*(1+'Project Description'!H967),0)","v":0},{"$f":"ROUND(Y46*(1+'Project Description'!H967),0)","v":0},{"$f":"ROUND(Z46*(1+'Project Description'!H967),0)","v":0},{"$f":"ROUND(AA46*(1+'Project Description'!H967),0)","v":0},{"$f":"ROUND(AB46*(1+'Project Description'!H967),0)","v":0},{"$f":"ROUND(AC46*(1+'Project Description'!H967),0)","v":0},{"$f":"ROUND(AD46*(1+'Project Description'!H967),0)","v":0},{"$f":"ROUND(AE46*(1+'Project Description'!H967),0)","v":0},{"$f":"ROUND(AF46*(1+'Project Description'!H967),0)","v":0},{"$f":"ROUND(AG46*(1+'Project Description'!H967),0)","v":0},{"$f":"ROUND(AH46*(1+'Project Description'!H967),0)","v":0},{"$f":"ROUND(AI46*(1+'Project Description'!H967),0)","v":0},{"$f":"ROUND(AJ46*(1+'Project Description'!H967),0)","v":0},{"$f":"ROUND(AK46*(1+'Project Description'!H967),0)","v":0},{"$f":"ROUND(AL46*(1+'Project Description'!H967),0)","v":0},{"$f":"ROUND(AM46*(1+'Project Description'!H967),0)","v":0},{"$f":"ROUND(AN46*(1+'Project Description'!H967),0)","v":0},{"$f":"ROUND(AO46*(1+'Project Description'!H967),0)","v":0}]
[]
[null,"Surplus Cash",{"$f":"MAX(0,C43-C46)","v":0},{"$f":"MAX(0,D43-D46)","v":0},0,0,0,0,0,0,0,0,0,0,0,0,0,0,0,0,0,0,0,0,0,0,0,0,0,0,0,0,0,0,0,0,0,0,0,0,0,0]
[]
[null,"Cumulative Surplus Cash",{"$f":"+C48","v":0},{"$f":"+C50+D48","v":0},{"$f":"+D50+E48","v":0},0,0,0,0,0,0,0,0,0,0,0,0,0,0,0,0,0,0,0,0,0,0,0,0,0,0,0,0,0,0,0,0,0,0,0,0,0]
[null,"Through Year 15",{"$f":"+Q50","v":0}]
[null,"Through Year 35",{"$f":"+AK50","v":0}]
[null,"Through Year 40",{"$f":"+AP50","v":0}]

{"sheet":"Selection Criteria","index":13,"n_rows":2078,"n_cols":23,"rows_kept":2078,"cut":false,"hidden":false,"merged":[[97,3,99,3],[97,4,99,4],[97,5,99,5],[17,1,17,2],[31,1,31,2],[18,1,18,2],[8,4,9,4],[8,3,9,3],[21,3,26,3],[30,3,31,3],[30,4,31,4],[21,4,26,4],[14,3,18,3],[14,4,18,4],[3,0,3,8],[121,3,125,3],[76,1,76,2],[118,3,119,3],[118,4,119,4],[55,1,55,2],[120,1,120,2],[47,3,48,3],[47,4,48,4],[52,4,54,4],[52,3,54,3],[116,1,116,2],[83,3,87,3],[90,3,92,3],[90,4,92,4],[5,3,5,4]]}
[]
[]
[{"$f":"+Instructions!A3","v":"2025 QAP Underwriting Application v1.1"}]
[{"$f":"+'Unit Mix and Rents'!A4","v":" ( LA), "}]
["Selection Criteria: Points Claimed by Taxpayer / Applicant"]
[null,null,null,"Calculated",null,"Self-Score",null,null,null,null,null,"Max"]
["I.","TARGETED PROJECT TYPE",null,null,null,null,null,null,null,null,null,11,null,null,null,null,null,"Scoring updated for 2025 QAP"]
["A.","De-Concentration Projects. (Only one selection allowed)"]
["i.","Project Diversity.",null,null,"points",0,null,null,{"$f":"TEXT(M9,\"0.0%\")&\" Low Income Units in Project\"","v":"0.0% Low Income Units in Project"},null,null,5,{"$f":"+'Unit Mix and Rents'!G44","v":0},null,null,null,null,"Scoring updated for 2022 QAP"]
["ii.","Geographic Diversity.",null,null,null,0,null,null,{"$f":"\"Census tract median income is \"&TEXT(M10,\"0.0%\")&\" of MSA\"","v":"Census tract median income is 0.0% of MSA"},null,null,5,{"$f":"IFERROR(+'Project Description'!M124,0)","v":0},"of MSA",{"$f":"IFERROR(+'Project Description'!M125,0)","v":0},"of Parish",null,"Scoring updated for 2025 QAP"]
[null,null,{"$f":"IF(AND(D10>0,'Project Description'!H121=\"Yes\"),\"Note -- LHC review needed for Geographic Diversity; project lies in multiple census tracts\",\"\")","v":""}]
[]
["A.","Community Redevelopment (select one. maximum 3 points allowed)"]
["i.","Redevelopment Project"]
[null,"a.     Distressed Property",null,{"$f":"MAX(H15:H19)","v":0},"points",0,null,{"$f":"IF(AND('Project Description'!H141=\"Yes\",'Project Description'!H129=\"Yes\",'Project Description'!H132=\"Yes\"),L15,0)","v":0},null,null,null,3]
[null,"b.     Redevelopment Property",null,null,null,0,null,{"$f":"IF(AND('Project Description'!H142=\"Yes\",'Project Description'!H129=\"Yes\",'Project Description'!H132=\"Yes\"),L16,0)","v":0},null,null,null,3]
[null,"c.     Owner Occupied / Plan of Action",null,null,null,0,null,{"$f":"IF(AND('Project Description'!H143=\"Yes\",'Project Description'!H129=\"Yes\",'Project Description'!H132=\"Yes\"),L17,0)","v":0},null,null,null,3]
["ii","New Construction Project included in a Concerted Community Revitalization Plan",null,null,null,0,null,{"$f":"IF(AND(M31=\"Yes\",'Project Description'!H129=\"Yes\",'Project Description'!H132=\"Yes\"),L18,0)","v":0},null,null,null,3]
["iii","PHA sponsored project",null,null,null,0,null,{"$f":"IF('Project Description'!H172=\"Yes\",L19,0)","v":0},null,null,null,3,null,null,null,null,null,"Scoring updated for 2025 QAP"]
[]
["B.","Rehabilitation & Preservation (Maximum 8 points)",null,null,null,null,null,null,null,null,null,null,{"$f":"'Project Description'!H103","v":"Missing"}," (any rehab?)"]
["i.a.","Existing LIHTC project",null,{"$f":"MAX(H22:H28)","v":0},"points",0,null,{"$f":"IF('Project Description'!H144=\"Yes\",L22,0)","v":0},null,null,null,8,null,null,null,null,null,"Scoring updated for 2025 QAP"]
["i.b","Existing USDA, LHC, or other Federally Funded Project",null,null,null,0,null,{"$f":"IF(AND(H22=0,'Project Description'!H145=\"Yes\"),L23,0)","v":0},{"$f":"IF(AND(F23>0,COUNTIF(F22:F23,\">0\")>1),\"Only one selection allowed in I.C.i\",\"\")","v":""},null,null,8,null,null,null,null,null,"Scoring updated for 2025 QAP"]
["i.c","Existing non-historic residential building",null,null,null,0,null,{"$f":"IF(AND(SUM(H22:H23)=0,'Project Description'!H146=\"Yes\"),L24,0)","v":0},{"$f":"IF(AND(F24>0,COUNTIF(F22:F24,\">0\")>1),\"Only one selection allowed in I.C.i\",\"\")","v":""},null,null,7]
["i.d","Blighted housing remediation and/or replacement",null,null,null,0,null,{"$f":"IF(AND(SUM(H22:H24)=0,'Project Description'!H147=\"Yes\"),L25,0)","v":0},{"$f":"IF(AND(F25>0,COUNTIF(F22:F25,\">0\")>1),\"Only one selection allowed in I.C.i\",\"\")","v":""},null,null,7]
["i.e","Rehab Infill / Scattered Site (not eligible community facility points)",null,null,null,0,null,{"$f":"IF(AND(SUM(H22:H25)=0,'Project Description'!H148=\"Yes\"),L26,0)","v":0},{"$f":"IF(AND(F26>0,COUNTIF(F22:F26,\">0\")>1),\"Only one selection allowed in I.C.i\",\"\")","v":""},null,null,7,{"$f":"+'Project Description'!H113","v":"Missing"}," (infill?)",{"$f":"+'Project Description'!H92","v":"Missing"}," (single site?)"]
["i.f","Preservation of Residential Historic Property",null,null,null,0,null,{"$f":"IF(AND(SUM(H22:H26)=0,'Project Description'!H149=\"Yes\"),L27,0)","v":0},{"$f":"IF(AND(F27>0,COUNTIF(F22:F27,\">0\")>1),\"Only one selection allowed in I.C.i\",\"\")","v":""},null,null,3]
["ii.","Existing Federally Funded with HAP Contract",null,null,"points",0,null,null,null,null,null,null,{"$f":"+'Project Description'!H150","v":"Missing"},"(Existing FF with HAP)",null,null,null,"Scoring updated for 2025 QAP"]
[]
["C.","New Construction (Maximum 8 points)",null,null,null,null,null,null,null,null,null,null,{"$f":"+'Project Description'!H96","v":"Missing"}," (any new const?)",null,{"$f":"+'Project Description'!H97","v":"Missing"},"new const (by # of units)"]
["i.a.","New Construction",null,{"$f":"MAX(H31:H32)","v":0},"points",0,null,{"$f":"IF(AND(M31=\"Yes\",M26<>\"Yes\"),L31,0)","v":0},{"$f":"IF(AND(F31<>0,F32<>0),\"Only one selection allowed\",\"\")","v":""},null,null,7,{"$f":"IF(AND(M30=\"Yes\",P30>=50%),\"Yes\",\"No\")","v":"No"}," (at least 50% new const by # units)"]
["i.b","New Construction Infill / Scattered Site (not eligible for points for community facility)",null,null,null,0,null,{"$f":"IF(AND(M31=\"Yes\",'Project Description'!H151=\"Yes\",H31=0),L32,0)","v":0},{"$f":"IF(AND(F31<>0,F32<>0),\"Only one selection allowed\",\"\")","v":""},null,null,7,null,null,null,null,null,null,"Scoring updated for 2022 QAP"]
["i.c","Homeownership Project",null,{"$f":"IF(AND(M31=\"Yes\",'Project Description'!H152=\"Yes\"),L33,0)","v":0},"points",0,null,null,null,null,null,1]
[]
[null,"Total for Section I - Maximum 11 points",null,{"$f":"MIN(L35,M35)","v":0},"points",{"$f":"SUM(F7:F34)","v":0},null,null,null,null,null,{"$f":"+L7","v":11},{"$f":"(MAX(D31,D22)+D9+D15+D28+D33)","v":0},"Section I Total",null,null,null,null,"Scoring updated for 2022 QAP"]
[]
["II.","TARGETED POPULATION TYPE",null,null,null,null,null,null,null,null,null,6]
["A.i.","Special Needs Households:",null,{"$f":"IF('Project Description'!H803<>\"Yes\",0,IF(M38>=30%,L38,IF(M38>=20%,L38-1,IF(M38>=10%,L38-2,0))))","v":0},"points",0,null,{"$f":"TEXT(M38,\"0.0%\")&\" of Total Units in Project for Special Needs\"","v":"0.0% of Total Units in Project for Special Needs"},null,null,null,6,{"$f":"IF('Project Description'!H803<>\"Yes\",0,'Project Description'!M813)","v":0}]
[null,{"$f":"IF(D38=0,\"\",\"Population type(s):\")","v":""},{"$f":"IF(D38=0,\"\",'Project Description'!E813)","v":""}]
["A.ii.","Elderly Households:",null,{"$f":"IF(AND(D38=0,'Project Description'!H815=\"Yes\"),L40,0)","v":0},"points",0,null,{"$f":"TEXT(M40,\"0.0%\")&\" of Total Units in Project for Elderly\"","v":"0.0% of Total Units in Project for Elderly"},null,null,null,6,{"$f":"IF('Project Description'!H815<>\"Yes\",0,1)","v":0}]
[]
[null,"Total for Section II - Maximum 6 points",null,{"$f":"MAX(D38,D40)","v":0},"points",{"$f":"SUM(F37:F41)","v":0},null,{"$f":"IF(AND(F38>0,F40>0),\"Cannot select both A and B\",\"\")","v":""},null,null,null,{"$f":"+L37","v":6}]
[]
["III.","PRIORITY DEVELOPMENT AREAS AND OTHER PREFERENCES",null,null,null,null,null,null,null,null,null,13]
["A.","Extended Affordability Agreement.",null,{"$f":"IF(AND('Project Description'!H819=\"Yes\",'Project Description'!H823=\"Yes\",'Project Description'!M825>0),'Project Description'!M825,0)","v":0},"points",0,null,{"$f":"IF(D45=0,\"No extended affordability\",'Project Description'!H825)","v":"No extended affordability"},null,null,null,7]
["B.","Increased Unit Affordability."]
["i.","Extremely Low Income Targeting."]
["    a.","Between 5% and 10% of units are non-PSH at 30% AMI or below.",null,null,"points",0,null,null,{"$f":"TEXT(M48,\"0.0%\")&\" of Total Units are non-PSH at 30% or below\"","v":"-5.0% of Total Units are non-PSH at 30% or below"},null,null,null,{"$f":"+'Unit Mix and Rents'!G47-5%","v":-0.05},{"$f":"IF(AND(M48>=5%,M48<10%),L48,0)","v":0}]
["    b.","Between 5% and 10% of units are PSH Units.",null,null,null,0,null,null,{"$f":"TEXT(M49,\"0.0%\")&\" of Total Units qualify as PSH Units\"","v":"-5.0% of Total Units qualify as PSH Units"},null,null,null,{"$f":"+'Unit Mix and Rents'!G46-5%","v":-0.05},{"$f":"IF(AND(M49>=5%,M49<10%),L49,0)","v":0}]
[null,null,null,null,null,null,null,{"$f":"IF(AND(F48>0,F49>0),\"Cannot select both a and b\",\"\")","v":""}]
["ii.","Very Low Income Targeting.",null,null,"points",0,null,{"$f":"TEXT(M51,\"0.0%\")&\" of Total Units at between 31%-50% AMI\"","v":"0.0% of Total Units at between 31%-50% AMI"},null,null,null,null,{"$f":"+'Unit Mix and Rents'!G51","v":0}]
["B.","Governmental Priorities."]
["i.",{"$f":"IF(M53=\"\",\"Project Not Located in Difficult Development Area (DDA)\",\"Project Located in  Difficult Development Area (DDA) or\")","v":"Project Not Located in Difficult Development Area (DDA)"},null,{"$f":"MAX(H53:H55)","v":0},"points",0,null,{"$f":"IF(M54=\"CNI\",0,IF(M53=\"\",0,L53))","v":0},null,null,null,2,{"$f":"IF('Project Description'!H128=\"Yes\",\"DDA\",\"\")","v":""}]
[null,{"$f":"IF(M54=\"\",\"Project Not Located in Qualified Census Tract (QCT)\",\"Project Located in Qualified Census Tract (QCT) or\")","v":"Project Not Located in Qualified Census Tract (QCT)"},null,null,null,0,null,{"$f":"IF(M54=\"\",0,L54)","v":0},null,null,null,2,{"$f":"IF('Project Description'!H129=\"Yes\",\"QCT\",\"\")","v":""}]
[null,{"$f":"IF(M55=\"\",\"Project Not Located in Federally or State recognized Tribal Organization (RTO)\",\"Project Located in Federally or State recognized Tribal Organization (RTO)\")","v":"Project Not Located in Federally or State recognized Tribal Organization (RTO)"},null,null,null,0,null,{"$f":"IF(M55=\"\",0,L55)","v":0},null,null,null,2,{"$f":"IF('Project Description'!H130=\"Yes\",\"RTO\",\"\")","v":""},null,{"$f":"+'Project Description'!E87","v":"Select"}]
["ii.","Located in a parish that (a) has not received an award of LIHTC within the last 20 years. Grant, La Salle, St. Charles, or St. Helena.",null,{"$f":"IF(OR(O55=\"Grant\",O55=\"LaSalle\",O55=\"St. Charles\",O55=\"St. Helena\"),2,0)","v":0},"points",0,null,null,null,null,null,2,null,null,null,null,null,null,"Scoring updated for 2025 QAP"]
["iii.c","Parish with cost-burdened renters above 53%",null,null,"points",0,null,{"$f":"TEXT(M57,\"0.0%\")&\" cost-burdened renters\"","v":"0.0% cost-burdened renters"},null,null,null,null,{"$f":"VLOOKUP(O55,Parishes!A9:AG73,27,FALSE)","v":0}]
["iii.c","Only one of the following:",null,null,null,null,null,{"$f":"IF(AND(F59>0,F60>0),\"Limited to 1 point in ii.d\",\"\")","v":""},null,null,null,null,null,null,null,null,null,"Scoring updated for 2019 QAP"]
["iii.d","Parish with children under 5 in poverty above 32%",null,null,"points",0,null,{"$f":"TEXT(M59,\"0.0%\")&\" children under 5 in poverty\"","v":"0.0% children under 5 in poverty"},null,null,null,null,{"$f":"VLOOKUP(O55,Parishes!A9:AG73,29,FALSE)","v":0}]
["iii.e","Parish with persons in poverty above 20%",null,null,"points",0,null,{"$f":"TEXT(M60,\"0.0%\")&\" persons in poverty\"","v":"0.0% persons in poverty"},null,null,null,null,{"$f":"VLOOKUP(O55,Parishes!A9:AG73,28,FALSE)","v":0},null,null,null,null,null,"Scoring updated for 2022 QAP"]
["iii.f","Parish with Median Household Income at or below 46,000",null,null,"points",0,null,{"$f":"TEXT(M61,\"#,##0\")&\" Median Household Income\"","v":"0 Median Household Income"},null,null,null,null,{"$f":"VLOOKUP(O55,Parishes!A9:AG73,30,FALSE)","v":0}]
["C.","Additional Financial Support",null,{"$f":"IF(M62>=7%,L62,IF(M62>=4%,L62-1,IF(M62>=2%,L62-2,0)))","v":0},"points",0,null,{"$f":"TEXT(M62,\"0.0%\")&\" of TDC in Additional Financial Support\"","v":"0.0% of TDC in Additional Financial Support"},null,null,null,4,{"$f":"IF('Project Description'!H827=\"Yes\",'Project Description'!M830,0)","v":0}]
[]
[null,"Total for Section III - Maximum 13 points",null,{"$f":"MIN(L64,M64)","v":0},"points",{"$f":"SUM(F44:F63)","v":0},null,null,null,null,null,{"$f":"+L44","v":13},{"$f":"SUM(D45:D62)","v":0},"Section III Total"]
[]
["IV.","LOCATION CHARACTERISTICS",null,null,null,null,null,null,null,null,null,5]
["A.","Neighborhood Features."]
["i.","Points Gained.",null,{"$f":"MIN(M68,L68)","v":0},"points",0,null,null,null,null,null,5,{"$f":"+'Project Description'!M834","v":0}]
[null,{"$f":"IF(AND(Q69=1,M69<0),\"Error -- there is a nearby negative neighborhood feature thas is prohibited under the QAP.\",\"\")","v":""},null,null,null,null,null,null,null,null,null,null,{"$f":"+'Project Description'!M861","v":0},"negative nhood feature",null,null,{"$f":"+'Project Description'!Q860","v":2}]
[]
[null,"Total for Section IV - Maximum 5 points",null,{"$f":"SUM(D67:D70)","v":0},"points",{"$f":"SUM(F66:F70)","v":0},null,null,null,null,null,{"$f":"+L66","v":5}]
[]
["V.","PROJECT CHARACTERISTICS",null,null,null,null,null,null,null,null,null,16]
["A.","Community Facilities.",null,{"$f":"IF(AND(S74<>\"Yes\",P74=\"Yes\",M74=\"Yes\",V74=0),L74,0)","v":0},"points",0,null,null,null,null,null,2,{"$f":"+'Project Description'!H880","v":"Missing"}," (CF?)",null,{"$f":"+'Project Description'!H92","v":"Missing"}," (single site project?)",null,{"$f":"+'Project Description'!H152","v":"Missing"}," (H.O. project?)",null,{"$f":"+H32+F32+H26+F26","v":0},"Points claimed for Infill / Scattered Site"]
["B.","Optional Amenities. *Provide architecture certification for the selected amenities."]
["i.","Washers and dryers required for new const. but no points",null,0,"points",{"$f":"+D76","v":0},null,null,null,null,null,0,null,null,null,null,null,null,"Scoring updated for 2022 QAP"]
["i.","Washers and dryers are installed and maintained in each unit (no points will be offered for offering hookups only. Equipment must be new.)",null,null,"points",0,null,null,null,null,null,null,{"$f":"+P81","v":"Missing"},{"$f":"+Q81","v":" (Any rehab)"},null,null,null,null,"Scoring updated for 2022 QAP"]
["ii.","Dishwashers maintained in each unit - Required",null,{"$f":"IF('Project Description'!H883=\"Yes\",L78,0)","v":0},"point",0,null,null,null,null,null,1]
["iv.","Smart thermostat installed in each unit",null,null,"point",0,null,null,null,null,null,null,{"$f":"+'Project Description'!H884","v":"Missing"},"Wi-Fi"]
[null,"*Applicant must provide documentation in the application submission"]
["iv.","  Green Building *",{"$f":"'Project Description'!H877","v":"Missing"},null,"points",0,null,{"$f":"IF('Project Description'!$H$877=\"Yes\",$B$81,\"\")","v":""},null,null,null,null,{"$f":"+'Project Description'!H877","v":"Missing"}," (Green Bldg)",null,{"$f":"+'Project Description'!H103","v":"Missing"}," (Any rehab)",null,"Scoring updated for 2025 QAP"]
["V.","  Universal Design *",null,null,"points",0,null,{"$f":"IF('Project Description'!$H$885=\"Yes\",$B$82,\"\")","v":""},null,null,null,null,null,null,null,null,null,null,"Scoring updated for 2022 QAP"]
["C.","Project Amenities.",null,null,null,null,null,{"$f":"M83&\" Project Amenities claimed\"","v":"0 Project Amenities claimed"},null,null,null,2,{"$f":"+'Project Description'!M891","v":0}]
[null,"Playground",null,{"$f":"MIN(M83,L83)","v":0},"point",0,null,{"$f":"IF('Project Description'!H892=\"Yes\",L84,0)","v":0},null,null,null,1]
[null,"Computer Center (minimum 5 computers)",null,null,"point",0,null,{"$f":"IF('Project Description'!H894=\"Yes\",L85,0)","v":0},null,null,null,1]
[null,"Exercise Room (must have equipment)",null,null,"point",0,null,{"$f":"IF('Project Description'!H895=\"Yes\",L86,0)","v":0},null,null,null,1]
[null,"Picnic Area with Permanent Grill",null,null,"point",0,null,{"$f":"IF('Project Description'!H896=\"Yes\",L87,0)","v":0},null,null,null,1]
[null,"Courtyard with Seating",null,null,"point",0,null,{"$f":"IF('Project Description'!H902=\"Yes\",L88,0)","v":0},null,null,null,1]
["D.","Additional Accessible Units.",null,{"$f":"IF(M89>=20%,L89,IF(M89>=10%,L89-1,0))","v":0},"points",0,null,{"$f":"+O89","v":0},"of total units are accessible",null,null,3,{"$f":"+'Project Description'!H910+'Project Description'!H913-'Project Description'!P907-'Project Description'!P908","v":0},"provided",{"$f":"IF('Unit Mix and Rents'!F41=0,0,+M89/'Unit Mix and Rents'!F41)","v":0},"In excess of Section 504"]
["E.","On-Site Security.",null,null,null,null,null,{"$f":"+'Project Description'!M921","v":""},null,null,null,1,{"$f":"SUM(H91:H93)","v":0}]
["i.","  Security Cameras.",null,{"$f":"MAX(H91:H93)","v":0},"points",0,null,{"$f":"IF('Project Description'!H919=\"Yes\",2,0)","v":0},null,null,null,2,null,null,null,null,null,null,"Scoring updated for 2019 QAP"]
[null,"  Security Gate.",null,null,null,0,null,{"$f":"IF('Project Description'!H920=\"Yes\",2,0)","v":0},null,null,null,2,null,null,null,null,null,null,"Scoring updated for 2019 QAP"]
[null,"  On Site Security Guard.",null,null,null,0,null,{"$f":"IF('Project Description'!H921=\"Yes\",2,0)","v":0},null,null,null,2,null,null,null,null,null,null,"Scoring updated for 2019 QAP"]
["ii.","Security cameras connect with local town crime surveillance initiative",null,{"$f":"IF('Project Description'!H922=\"Yes\",L94,0)","v":0},"point",0,null,null,null,null,null,1]
["F.","TDC At Least 15% Below Maximum TDC Per Unit.",null,null,"points",0,null,{"$f":"+M95","v":{"$error":"#N/A"}},{"$f":"+N95","v":{"$error":"#N/A"}},null,null,0,{"$f":"+'Development Costs'!F255-1","v":{"$error":"#N/A"}},{"$f":"IF(M95>0,\"above the Maximum TDC\",IF(M95<0,\"below the Maximum TDC\",\"\"))","v":{"$error":"#N/A"}}]
["F.","HUD Defensible Space",null,{"$f":"IF('Project Description'!H886=\"Yes\",L96,0)","v":0},"points",0,null,null,null,null,null,2,{"$f":"+'Project Description'!H96","v":"Missing"}," (Any new const.)",null,null,null,null,"Scoring updated for 2022 QAP"]
["G.","Federally Qualified Health Centers (FQHC)"]
["a.","On-site once a year",null,{"$f":"IF(M99=B100,3,IF(M99=B99,2, IF(M99=B98,1,IF(M99=B98,1,0))))","v":0},"points",0,null,null,null,null,null,1]
["b.","On-site twice a year",null,null,null,null,null,null,null,null,null,2,{"$f":"'Project Description'!H887","v":"Missing"},null,null,null,null,null,"Scoring updated for 2025 QAP"]
["c.","On-site Quarterly",null,null,null,null,null,null,null,null,null,3]
[null,"Missing"]
[]
[null,"Total for Section V - Maximum 16 points",null,{"$f":"MIN(L103,M103)","v":0},"points",{"$f":"SUM(F73:F101)","v":0},null,null,null,null,null,{"$f":"+L73","v":16},{"$f":"SUM(D74:D99)","v":0},"Section Total"]
[]
["VI.","THRESHOLD REQUIREMENTS - Please acknowledge that all of the following requirements have been met."]
[]
["H.","30% AMI And Target Population"]
[null,"All Projects must set aside at least 5% of units for households with incomes at or below 30% AMI",null,null,null,"No",null,null,null,null,null,{"$f":"IF(N108>=5%,\"Yes\",\"No\")","v":"No"},{"$f":"'Unit Mix and Rents'!F47","v":0},{"$f":"'Unit Mix and Rents'!G47","v":0}]
[]
["I.","Resiliency Standards: Required for projects located in Tier 1 or Tier 2 parishes",null,null,null,null,null,null,null,null,null,null,null,null,null,null,null,null,"Scoring updated for 2022 QAP"]
[null,"FORTIFIED Roofs, windows, and doors:",null,{"$f":"IF(F111=\"Yes\",\"\",IF('Project Description'!H929=\"Yes\",L111,\"Required\"))","v":"Required"},null,"No",null,null,null,null,null,{"$f":"'Project Description'!M928","v":""},{"$f":"IF(L111=\"Yes\",\"Required\",\"\")","v":""}," (Tier 1 or 2))"]
[null,"FORTIFIED SILVER:",null,null,null,0,null,null,null,null,null,null,{"$f":"+'Project Description'!H96","v":"Missing"}," (Any new const.)"]
["J.","Eviction Prevention and Low Barrier Tenant Screening ",null,null,null,null,null,null,null,null,null,null,null,null,null,null,null,null,"Scoring updated for 2022 QAP"]
[null,"Eviction Prevention Plan",null,{"$f":"IF(F114=\"Yes\",\"\",IF('Project Description'!H932=\"Yes\",L114,\"Required\"))","v":"Required"},null,"No",null,null,null,null,null,"Yes","Required"]
[null,"Low-Barrier Tenant Screening",null,{"$f":"IF(F115=\"Yes\",\"\",IF('Project Description'!H933=\"Yes\",L115,\"Required\"))","v":"Required"},null,"No",null,null,null,null,null,"Yes","Required"]
["I.","Diversity, Equity & Inclusion - Maximum 9 Points",null,null,null,null,null,null,null,null,null,2,null,null,null,null,null,null,"Scoring updated for 2022 QAP"]
["i.","(i) Material Participation of Minority, Women’s and Veteran’s Businesses – up to 4 points",null,null,null,null,null,null,null,null,null,null,null,null,null,null,null,null,"Scoring updated for 2022 QAP"]
[null,"Professional Services/ General\nContractor",null,null,"points",0,null,null,null,null,null,2]
[null,"Sub-Contractors/Vendors 1%-4.99% of Total Development Cost",null,null,"points",0,null,null,null,null,null,1]
[null,"Sub-Contractors/Vendors >5% of Total Development Cost",null,null,null,0,null,null,null,null,null,2]
["ii.","Points for JV with a Certified Minority Entity, Woman-Owned Business, Veteran-Owned Business, Service Disabled Veteran-Owned Business or a Qualified Small Business (Max 5 points)",null,null,null,null,null,null,null,null,null,5]
[null,"JV with a Certified Minority Entity",null,null,"points",0,null,null,null,null,null,5]
[null,"Woman-Owned Business",null,null,"points",0,null,null,null,null,null,5]
[null,"Veteran-Owned Business",null,null,"points",0,null,null,null,null,null,5]
[null,"Service Disabled Veteran-Owned Business",null,null,"points",0,null,null,null,null,null,5]
[null,"Qualified Small Business",null,null,"points",0,null,null,null,null,null,5]
["K.","Development Wi-Fi - Architect Certification is required",null,{"$f":"IF(F127=\"Yes\",\"\",IF('Project Description'!H884=\"Yes\",L127,\"Required\"))","v":"Required"},null,"No",null,null,null,null,null,"Yes","Required"]
[]
[null,"TOTAL POINTS (TO BE CONFIRMED BY LHC)",null,{"$f":"+D103+D71+D64+D42+D35","v":0},"POINTS",{"$f":"+F103+F71+F64+F42+F35","v":0},"POINTS",null,null,null,null,{"$f":"+L73+L66+L44+L37+L7","v":51}]
[]
[]
[]
[]
[]
[]
[]
[]
[]
[]
[]
[]
[]
[]
[]
[]
[]
[]
[]
[]
[]
[]
[]
[]
[]
[]
[]
[]
[]
[]
[]
[]
[]
[]
[]
[]
[]
[]
[]
[]
[]
[]
[]
[]
[]
[]
[]
[]
[]
[]
[]
[]
[]
[]
[]
[]
[]
[]
[]
[]
[]
[]
[]
[]
[]
[]
[]
[]
[]
[]
[]
[]
[]
[]
[]
[]
[]
[]
[]
[]
[]
[]
[]
[]
[]
[]
[]
[]
[]
[]
[]
[]
[]
[]
[]
[]
[]
[]
[]
[]
[]
[]
[]
[]
[]
[]
[]
[]
[]
[]
[]
[]
[]
[]
[]
[]
[]
[]
[]
[]
[]
[]
[]
[]
[]
[]
[]
[]
[]
[]
[]
[]
[]
[]
[]
[]
[]
[]
[]
[]
[]
[]
[]
[]
[]
[]
[]
[]
[]
[]
[]
[]
[]
[]
[]
[]
[]
[]
[]
[]
[]
[]
[]
[]
[]
[]
[]
[]
[]
[]
[]
[]
[]
[]
[]
[]
[]
[]
[]
[]
[]
[]
[]
[]
[]
[]
[]
[]
[]
[]
[]
[]
[]
[]
[]
[]
[]
[]
[]
[]
[]
[]
[]
[]
[]
[]
[]
[]
[]
[]
[]
[]
[]
[]
[]
[]
[]
[]
[]
[]
[]
[]
[]
[]
[]
[]
[]
[]
[]
[]
[]
[]
[]
[]
[]
[]
[]
[]
[]
[]
[]
[]
[]
[]
[]
[]
[]
[]
[]
[]
[]
[]
[]
[]
[]
[]
[]
[]
[]
[]
[]
[]
[]
[]
[]
[]
[]
[]
[]
[]
[]
[]
[]
[]
[]
[]
[]
[]
[]
[]
[]
[]
[]
[]
[]
[]
[]
[]
[]
[]
[]
[]
[]
[]
[]
[]
[]
[]
[]
[]
[]
[]
[]
[]
[]
[]
[]
[]
[]
[]
[]
[]
[]
[]
[]
[]
[]
[]
[]
[]
[]
[]
[]
[]
[]
[]
[]
[]
[]
[]
[]
[]
[]
[]
[]
[]
[]
[]
[]
[]
[]
[]
[]
[]
[]
[]
[]
[]
[]
[]
[]
[]
[]
[]
[]
[]
[]
[]
[]
[]
[]
[]
[]
[]
[]
[]
[]
[]
[]
[]
[]
[]
[]
[]
[]
[]
[]
[]
[]
[]
[]
[]
[]
[]
[]
[]
[]
[]
[]
[]
[]
[]
[]
[]
[]
[]
[]
[]
[]
[]
[]
[]
[]
[]
[]
[]
[]
[]
[]
[]
[]
[]
[]
[]
[]
[]
[]
[]
[]
[]
[]
[]
[]
[]
[]
[]
[]
[]
[]
[]
[]
[]
[]
[]
[]
[]
[]
[]
[]
[]
[]
[]
[]
[]
[]
[]
[]
[]
[]
[]
[]
[]
[]
[]
[]
[]
[]
[]
[]
[]
[]
[]
[]
[]
[]
[]
[]
[]
[]
[]
[]
[]
[]
[]
[]
[]
[]
[]
[]
[]
[]
[]
[]
[]
[]
[]
[]
[]
[]
[]
[]
[]
[]
[]
[]
[]
[]
[]
[]
[]
[]
[]
[]
[]
[]
[]
[]
[]
[]
[]
[]
[]
[]
[]
[]
[]
[]
[]
[]
[]
[]
[]
[]
[]
[]
[]
[]
[]
[]
[]
[]
[]
[]
[]
[]
[]
[]
[]
[]
[]
[]
[]
[]
[]
[]
[]
[]
[]
[]
[]
[]
[]
[]
[]
[]
[]
[]
[]
[]
[]
[]
[]
[]
[]
[]
[]
[]
[]
[]
[]
[]
[]
[]
[]
[]
[]
[]
[]
[]
[]
[]
[]
[]
[]
[]
[]
[]
[]
[]
[]
[]
[]
[]
[]
[]
[]
[]
[]
[]
[]
[]
[]
[]
[]
[]
[]
[]
[]
[]
[]
[]
[]
[]
[]
[]
[]
[]
[]
[]
[]
[]
[]
[]
[]
[]
[]
[]
[]
[]
[]
[]
[]
[]
[]
[]
[]
[]
[]
[]
[]
[]
[]
[]
[]
[]
[]
[]
[]
[]
[]
[]
[]
[]
[]
[]
[]
[]
[]
[]
[]
[]
[]
[]
[]
[]
[]
[]
[]
[]
[]
[]
[]
[]
[]
[]
[]
[]
[]
[]
[]
[]
[]
[]
[]
[]
[]
[]
[]
[]
[]
[]
[]
[]
[]
[]
[]
[]
[]
[]
[]
[]
[]
[]
[]
[]
[]
[]
[]
[]
[]
[]
[]
[]
[]
[]
[]
[]
[]
[]
[]
[]
[]
[]
[]
[]
[]
[]
[]
[]
[]
[]
[]
[]
[]
[]
[]
[]
[]
[]
[]
[]
[]
[]
[]
[]
[]
[]
[]
[]
[]
[]
[]
[]
[]
[]
[]
[]
[]
[]
[]
[]
[]
[]
[]
[]
[]
[]
[]
[]
[]
[]
[]
[]
[]
[]
[]
[]
[]
[]
[]
[]
[]
[]
[]
[]
[]
[]
[]
[]
[]
[]
[]
[]
[]
[]
[]
[]
[]
[]
[]
[]
[]
[]
[]
[]
[]
[]
[]
[]
[]
[]
[]
[]
[]
[]
[]
[]
[]
[]
[]
[]
[]
[]
[]
[]
[]
[]
[]
[]
[]
[]
[]
[]
[]
[]
[]
[]
[]
[]
[]
[]
[]
[]
[]
[]
[]
[]
[]
[]
[]
[]
[]
[]
[]
[]
[]
[]
[]
[]
[]
[]
[]
[]
[]
[]
[]
[]
[]
[]
[]
[]
[]
[]
[]
[]
[]
[]
[]
[]
[]
[]
[]
[]
[]
[]
[]
[]
[]
[]
[]
[]
[]
[]
[]
[]
[]
[]
[]
[]
[]
[]
[]
[]
[]
[]
[]
[]
[]
[]
[]
[]
[]
[]
[]
[]
[]
[]
[]
[]
[]
[]
[]
[]
[]
[]
[]
[]
[]
[]
[]
[]
[]
[]
[]
[]
[]
[]
[]
[]
[]
[]
[]
[]
[]
[]
[]
[]
[]
[]
[]
[]
[]
[]
[]
[]
[]
[]
[]
[]
[]
[]
[]
[]
[]
[]
[]
[]
[]
[]
[]
[]
[]
[]
[]
[]
[]
[]
[]
[]
[]
[]
[]
[]
[]
[]
[]
[]
[]
[]
[]
[]
[]
[]
[]
[]
[]
[]
[]
[]
[]
[]
[]
[]
[]
[]
[]
[]
[]
[]
[]
[]
[]
[]
[]
[]
[]
[]
[]
[]
[]
[]
[]
[]
[]
[]
[]
[]
[]
[]
[]
[]
[]
[]
[]
[]
[]
[]
[]
[]
[]
[]
[]
[]
[]
[]
[]
[]
[]
[]
[]
[]
[]
[]
[]
[]
[]
[]
[]
[]
[]
[]
[]
[]
[]
[]
[]
[]
[]
[]
[]
[]
[]
[]
[]
[]
[]
[]
[]
[]
[]
[]
[]
[]
[]
[]
[]
[]
[]
[]
[]
[]
[]
[]
[]
[]
[]
[]
[]
[]
[]
[]
[]
[]
[]
[]
[]
[]
[]
[]
[]
[]
[]
[]
[]
[]
[]
[]
[]
[]
[]
[]
[]
[]
[]
[]
[]
[]
[]
[]
[]
[]
[]
[]
[]
[]
[]
[]
[]
[]
[]
[]
[]
[]
[]
[]
[]
[]
[]
[]
[]
[]
[]
[]
[]
[]
[]
[]
[]
[]
[]
[]
[]
[]
[]
[]
[]
[]
[]
[]
[]
[]
[]
[]
[]
[]
[]
[]
[]
[]
[]
[]
[]
[]
[]
[]
[]
[]
[]
[]
[]
[]
[]
[]
[]
[]
[]
[]
[]
[]
[]
[]
[]
[]
[]
[]
[]
[]
[]
[]
[]
[]
[]
[]
[]
[]
[]
[]
[]
[]
[]
[]
[]
[]
[]
[]
[]
[]
[]
[]
[]
[]
[]
[]
[]
[]
[]
[]
[]
[]
[]
[]
[]
[]
[]
[]
[]
[]
[]
[]
[]
[]
[]
[]
[]
[]
[]
[]
[]
[]
[]
[]
[]
[]
[]
[]
[]
[]
[]
[]
[]
[]
[]
[]
[]
[]
[]
[]
[]
[]
[]
[]
[]
[]
[]
[]
[]
[]
[]
[]
[]
[]
[]
[]
[]
[]
[]
[]
[]
[]
[]
[]
[]
[]
[]
[]
[]
[]
[]
[]
[]
[]
[]
[]
[]
[]
[]
[]
[]
[]
[]
[]
[]
[]
[]
[]
[]
[]
[]
[]
[]
[]
[]
[]
[]
[]
[]
[]
[]
[]
[]
[]
[]
[]
[]
[]
[]
[]
[]
[]
[]
[]
[]
[]
[]
[]
[]
[]
[]
[]
[]
[]
[]
[]
[]
[]
[]
[]
[]
[]
[]
[]
[]
[]
[]
[]
[]
[]
[]
[]
[]
[]
[]
[]
[]
[]
[]
[]
[]
[]
[]
[]
[]
[]
[]
[]
[]
[]
[]
[]
[]
[]
[]
[]
[]
[]
[]
[]
[]
[]
[]
[]
[]
[]
[]
[]
[]
[]
[]
[]
[]
[]
[]
[]
[]
[]
[]
[]
[]
[]
[]
[]
[]
[]
[]
[]
[]
[]
[]
[]
[]
[]
[]
[]
[]
[]
[]
[]
[]
[]
[]
[]
[]
[]
[]
[]
[]
[]
[]
[]
[]
[]
[]
[]
[]
[]
[]
[]
[]
[]
[]
[]
[]
[]
[]
[]
[]
[]
[]
[]
[]
[]
[]
[]
[]
[]
[]
[]
[]
[]
[]
[]
[]
[]
[]
[]
[]
[]
[]
[]
[]
[]
[]
[]
[]
[]
[]
[]
[]
[]
[]
[]
[]
[]
[]
[]
[]
[]
[]
[]
[]
[]
[]
[]
[]
[]
[]
[]
[]
[]
[]
[]
[]
[]
[]
[]
[]
[]
[]
[]
[]
[]
[]
[]
[]
[]
[]
[]
[]
[]
[]
[]
[]
[]
[]
[]
[]
[]
[]
[]
[]
[]
[]
[]
[]
[]
[]
[]
[]
[]
[]
[]
[]
[]
[]
[]
[]
[]
[]
[]
[]
[]
[]
[]
[]
[]
[]
[]
[]
[]
[]
[]
[]
[]
[]
[]
[]
[]
[]
[]
[]
[]
[]
[]
[]
[]
[]
[]
[]
[]
[]
[]
[]
[]
[]
[]
[]
[]
[]
[]
[]
[]
[]
[]
[]
[]
[]
[]
[]
[]
[]
[]
[]
[]
[]
[]
[]
[]
[]
[]
[]
[]
[]
[]
[]
[]
[]
[]
[]
[]
[]
[]
[]
[]
[]
[]
[]
[]
[]
[]
[]
[]
[]
[]
[]
[]
[]
[]
[]
[]
[]
[]
[]
[]
[]
[]
[]
[]
[]
[]
[]
[]
[]
[]
[]
[]
[]
[]
[]
[]
[]
[]
[]
[]
[]
[]
[]
[]
[]
[]
[]
[]
[]
[]
[]
[]
[]
[]
[]
[]
[]
[]
[]
[]
[]
[]
[]
[]
[]
[]
[]
[]
[]
[]
[]
[]
[]
[]
[]
[]
[]
[]
[]
[]
[]
[]
[]
[]
[]
[]
[]
[]
[]
[]
[]
[]
[]
[]
[]
[]
[]
[]
[]
[]
[]
[]
[]
[]
[]
[]
[]
[]
[]
[]
[]
[]
[]
[]
[]
[]
[]
[]
[]
[]
[]
[]
[]
[]
[]
[]
[]
[]
[]
[]
[]
[]
[]
[]
[]
[]
[]
[]
[]
[]
[]
[]
[]
[]
[]
[]
[]
[]
[]
[]
[]
[]
[]
[]
[]
[]
[]
[]
[]
[]
[]
[]
[]
[]
[]
[]
[]
[]
[]
[]
[]
[]
[]
[]
[]
[]
[]
[]
[]
[]
[]
[]
[]
[]
[]
[]
[]
[]
[]
[]
[]
[]
[]
[]
[]
[]
[]
[]
[]
[]
[]
[]
[]
[]
[]
[]
[]
[]
[]
[]
[]
[]
[]
[]
[]
[]
[]
[]
[]
[]
[]
[]
[]
[]
[]
[]
[]
[]
[]
[]
[]
[]
[]
[]
[]
[]
[]
[]
[]
[]
[]
[]
[]
[]
[]
[]
[]
[]
[]
[]
[]
[]
[]
[]
[]
[]
[]
[]
[]
[]
[]
[]
[]
[]
[]
[]
[]
[]
[]
[]
[]
[]
[]
[]
[]
[]
[]
[]
[]
[]
[]
[]
[]
[]
[]
[]
[]
[]
[]
[]
[]
[]
[]
[]
[]
[null,null,"m ,"]

{"sheet":"Summary","index":14,"n_rows":84,"n_cols":11,"rows_kept":84,"cut":false,"hidden":false,"merged":[[83,0,83,7],[42,3,42,4],[43,3,43,4],[44,3,44,4],[45,3,45,4],[68,3,68,4],[57,3,57,4],[47,3,47,4],[58,3,58,4],[60,3,60,4],[61,3,61,4],[62,3,62,4],[52,3,52,4],[51,3,51,4],[53,3,53,4],[48,3,48,4],[67,3,67,4],[49,3,49,4],[50,3,50,4],[54,3,54,4],[55,3,55,4],[56,3,56,4],[3,0,3,7],[63,3,63,4],[64,3,64,4],[65,3,65,4],[66,3,66,4],[37,3,37,4],[38,3,38,4],[39,3,39,4],[40,3,40,4],[41,3,41,4]]}
[]
[]
[{"$f":"+Instructions!A3","v":"2025 QAP Underwriting Application v1.1"}]
[{"$f":"TRIM('Project Description'!E84)&\" (\"&TRIM('Project Description'!E86)&\" LA), \"&'Project Description'!E50","v":" ( LA), "}]
[]
["Project Summary"]
[]
["Taxpayer Name",{"$f":"+'Project Description'!E36","v":0}]
["Developer",{"$f":"+'Project Description'!E50","v":0}]
["Management Agent",{"$f":"+'Project Description'!E76","v":0}]
["City",{"$f":"+'Project Description'!E86","v":0}]
["Parish",{"$f":"+'Project Description'!E87","v":"Select"}]
["Number of Units",{"$f":"TEXT('Unit Mix and Rents'!F41,\"0\")&\" total units and \"&TEXT('Unit Mix and Rents'!O41,\"0\")&\" LIHTC Units\"","v":"0 total units and 0 LIHTC Units"}]
[]
[{"$f":"\"The applicant's self-score is \"&TEXT('Selection Criteria'!F129,\"0.0\")&\" points.\"","v":"The applicant's self-score is 0.0 points."}]
[]
[{"$f":"\"The primary development type is \"&'Project Description'!H95&\"; the primary building type is \"&'Project Description'!H117","v":"The primary development type is Missing; the primary building type is Missing"}]
[]
[{"$f":"\"Taxpayer is requesting \"&TEXT('Project Description'!H204,\"#,##0\")&\" of LIHTCs in the \"&'Project Description'!H177&\" Pool.\"","v":"Taxpayer is requesting 0 of LIHTCs in the Missing              Pool."}]
[{"$f":"\"Taxpayer is requesting \"&TEXT('Project Description'!H183,\"#,##0\")&\" of NHTF, \"&TEXT('Project Description'!H189,\"#,##0\")&\" of HOME, and \"&TEXT('Project Description'!H195,\"#,##0\")&\" of CDBG-DR.\"","v":"Taxpayer is requesting 0 of NHTF, 0 of HOME, and 0 of CDBG-DR."}]
[{"$f":"\"LHC Funding Type is \"&'Project Description'!D30&\".\"","v":"LHC Funding Type is ."}]
[]
["Unit Mix Summary","0 BR","1 BR","2 BR","3 BR","4 BR","Total"]
[{"$f":"+'Unit Mix and Rents'!B66","v":"20% AMI"},{"$f":"+'Unit Mix and Rents'!C66","v":0},{"$f":"+'Unit Mix and Rents'!D66","v":0},{"$f":"+'Unit Mix and Rents'!E66","v":0},{"$f":"+'Unit Mix and Rents'!F66","v":0},{"$f":"+'Unit Mix and Rents'!G66","v":0},{"$f":"SUM(B24:F24)","v":0}]
[{"$f":"+'Unit Mix and Rents'!B67","v":"30% AMI"},{"$f":"+'Unit Mix and Rents'!C67","v":0},{"$f":"+'Unit Mix and Rents'!D67","v":0},{"$f":"+'Unit Mix and Rents'!E67","v":0},{"$f":"+'Unit Mix and Rents'!F67","v":0},{"$f":"+'Unit Mix and Rents'!G67","v":0},0]
[{"$f":"+'Unit Mix and Rents'!B68","v":"40% AMI"},{"$f":"+'Unit Mix and Rents'!C68","v":0},{"$f":"+'Unit Mix and Rents'!D68","v":0},{"$f":"+'Unit Mix and Rents'!E68","v":0},{"$f":"+'Unit Mix and Rents'!F68","v":0},{"$f":"+'Unit Mix and Rents'!G68","v":0},0]
[{"$f":"+'Unit Mix and Rents'!B69","v":"50% AMI"},{"$f":"+'Unit Mix and Rents'!C69","v":0},{"$f":"+'Unit Mix and Rents'!D69","v":0},{"$f":"+'Unit Mix and Rents'!E69","v":0},{"$f":"+'Unit Mix and Rents'!F69","v":0},{"$f":"+'Unit Mix and Rents'!G69","v":0},0]
[{"$f":"+'Unit Mix and Rents'!B70","v":"60% AMI"},{"$f":"+'Unit Mix and Rents'!C70","v":0},{"$f":"+'Unit Mix and Rents'!D70","v":0},{"$f":"+'Unit Mix and Rents'!E70","v":0},{"$f":"+'Unit Mix and Rents'!F70","v":0},{"$f":"+'Unit Mix and Rents'!G70","v":0},0]
[{"$f":"+'Unit Mix and Rents'!B71","v":"70% AMI"},{"$f":"+'Unit Mix and Rents'!C71","v":0},{"$f":"+'Unit Mix and Rents'!D71","v":0},{"$f":"+'Unit Mix and Rents'!E71","v":0},{"$f":"+'Unit Mix and Rents'!F71","v":0},{"$f":"+'Unit Mix and Rents'!G71","v":0},0]
[{"$f":"+'Unit Mix and Rents'!B72","v":"80% AMI"},{"$f":"+'Unit Mix and Rents'!C72","v":0},{"$f":"+'Unit Mix and Rents'!D72","v":0},{"$f":"+'Unit Mix and Rents'!E72","v":0},{"$f":"+'Unit Mix and Rents'!F72","v":0},{"$f":"+'Unit Mix and Rents'!G72","v":0},0]
[{"$f":"+'Unit Mix and Rents'!B73","v":"120% AMI"},{"$f":"+'Unit Mix and Rents'!C73","v":0},{"$f":"+'Unit Mix and Rents'!D73","v":0},{"$f":"+'Unit Mix and Rents'!E73","v":0},{"$f":"+'Unit Mix and Rents'!F73","v":0},{"$f":"+'Unit Mix and Rents'!G73","v":0},0]
[{"$f":"+'Unit Mix and Rents'!B74","v":"Not AMI Restricted"},{"$f":"+'Unit Mix and Rents'!C74","v":0},{"$f":"+'Unit Mix and Rents'!D74","v":0},{"$f":"+'Unit Mix and Rents'!E74","v":0},{"$f":"+'Unit Mix and Rents'!F74","v":0},{"$f":"+'Unit Mix and Rents'!G74","v":0},0]
["Total Units",{"$f":"SUM(B24:B32)","v":0},0,0,0,0,0]
[]
[{"$f":"+'Unit Mix and Rents'!B77","v":"PSH Units"},{"$f":"+'Unit Mix and Rents'!C77","v":0},{"$f":"+'Unit Mix and Rents'!D77","v":0},{"$f":"+'Unit Mix and Rents'!E77","v":0},{"$f":"+'Unit Mix and Rents'!F77","v":0},{"$f":"+'Unit Mix and Rents'!G77","v":0},{"$f":"SUM(B35:F35)","v":0}]
[]
["Operating Budget"]
[{"$f":"+'Project Description'!B998","v":"Gross Potential Rental Income"},null,null,{"$f":"+'Project Description'!H998","v":0}]
[{"$f":"+'Project Description'!B999","v":"Rent Loss (years 1-3)"},null,null,{"$f":"+'Project Description'!H999","v":0},null,{"$f":"+'Project Description'!D999","v":7.0000000000000007E-2}]
[{"$f":"+'Project Description'!B1000","v":"Other Income"},null,null,{"$f":"+'Project Description'!H1000","v":0}]
["Effective Gross Income",null,null,{"$f":"+'Project Description'!H1002","v":0}]
["Total Operating Expenses",null,null,{"$f":"+'Project Description'!H1004","v":0},null,{"$f":"+'Revenues and Expenses'!D89","v":0},"PUPA"]
[{"$f":"+'Project Description'!B1007","v":"Net Operating Income"},null,null,{"$f":"+'Project Description'!H1007","v":0}]
[{"$f":"+'Project Description'!B1009","v":"Must Pay Debt Service"},null,null,{"$f":"-SUM('Project Description'!H1009:H1013)","v":0}]
["Operating Cash Flow",null,null,{"$f":"+'Project Description'!H1014","v":0}]
[{"$f":"+'Project Description'!B1015","v":"DSCR Year 1"},null,null,{"$f":"+'Project Description'!H1015","v":0}]
[]
["Total Sources of Funds",null,null,{"$f":"+'Project Description'!H529","v":0},null,{"$f":"+IF(G33=0,0,D48/G33)","v":0},"per unit"]
[{"$f":"+'Project Description'!B512","v":"New LHC Risk Sharing First Mortgage Loan"},null,null,{"$f":"+'Project Description'!H512","v":0},null,{"$f":"+IF(G33=0,0,D49/G33)","v":0}]
[{"$f":"+'Project Description'!B513","v":"Other Loan With Must-Pay Debt Service"},null,null,{"$f":"+'Project Description'!H513","v":0},null,{"$f":"+IF(G33=0,0,D50/G33)","v":0}]
[{"$f":"+'Project Description'!B514","v":"Non-LHC loan #2 (identify lender):"},null,null,{"$f":"+'Project Description'!H514","v":0},null,{"$f":"+IF(G33=0,0,D51/G33)","v":0}]
[{"$f":"+'Project Description'!B515","v":"LHC HOME Loan"},null,null,{"$f":"+'Project Description'!H515","v":0},null,{"$f":"+IF(G33=0,0,D52/G33)","v":0}]
[{"$f":"+'Project Description'!B516","v":"LHC NHTF Loan"},null,null,{"$f":"+'Project Description'!H516","v":0},null,{"$f":"+IF(G33=0,0,D53/G33)","v":0}]
[{"$f":"+'Project Description'!B517","v":"CDBG-DR Gap Financing Loan"},null,null,{"$f":"+'Project Description'!H517","v":0},null,{"$f":"+IF(G33=0,0,D54/G33)","v":0}]
[{"$f":"+'Project Description'!B518","v":"Deferred Developer Fee"},null,null,{"$f":"+'Project Description'!H518","v":0},null,{"$f":"+IF(G33=0,0,D55/G33)","v":0}]
[{"$f":"+'Project Description'!B519","v":"Federal Historic Tax Credits and Equity"},null,null,{"$f":"+'Project Description'!H519","v":0},null,{"$f":"+IF(G33=0,0,D56/G33)","v":0}]
[{"$f":"+'Project Description'!B520","v":"State Historic Tax Credits and Equity"},null,null,{"$f":"+'Project Description'!H520","v":0},null,{"$f":"+IF(G33=0,0,D57/G33)","v":0}]
[{"$f":"+'Project Description'!B521","v":"Estimated LIHTC Equity Proceeds"},null,null,{"$f":"+'Project Description'!H521","v":0},null,{"$f":"+IF(G33=0,0,D58/G33)","v":0}]
["Other",null,null,{"$f":"D48-SUM(D49:E58)","v":0},null,{"$f":"+IF(G33=0,0,D59/G33)","v":0}]
[]
["Total Development Cost",null,null,{"$f":"+'Development Costs'!C229","v":0},null,{"$f":"+IF(G33=0,0,D61/G33)","v":0},"per unit"]
[{"$f":"+'Development Costs'!B201","v":"Building Acquisition"},null,null,{"$f":"+'Development Costs'!C201","v":0},null,{"$f":"+IF(G33=0,0,D62/G33)","v":0}]
[{"$f":"+'Development Costs'!B202","v":"Land Acquisition"},null,null,{"$f":"+'Development Costs'!C202","v":0},null,{"$f":"+IF(G33=0,0,D63/G33)","v":0}]
["Total Hard Costs",null,null,{"$f":"SUM('Development Costs'!C203:C210)","v":0},null,{"$f":"+IF(G33=0,0,D64/G33)","v":0},null,null,null,null,{"$f":"SUM(D64:D64)","v":0}]
["Builder Compensation",null,0,0,null,0,null,null,null,null,{"$f":"SUM(D64:D65)","v":0}]
["Construction Contingency",null,{"$f":"IF(K65=0,0,D66/K65)","v":0},{"$f":"+'Development Costs'!C212","v":0},null,{"$f":"+IF(G33=0,0,D66/G33)","v":0},null,null,null,null,{"$f":"SUM(D64:D66)","v":0}]
["Total Developer's Fee",null,{"$f":"IF(K66=0,0,D67/K66)","v":0},{"$f":"+SUM('Development Costs'!C226:C227)","v":0},null,{"$f":"+IF(G33=0,0,D67/G33)","v":0}]
["Initial Reserves",null,null,{"$f":"SUM('Development Costs'!C218:C223)","v":0},null,{"$f":"+IF(G33=0,0,D68/G33)","v":0}]
["Soft Costs / Other",null,null,{"$f":"D61-SUM(D62:E68)","v":0},null,{"$f":"+IF(G33=0,0,D69/G33)","v":0}]
[]
["DSCR from Cash Flow Proforma:"]
["Year 1",null,null,null,{"$f":"+'Project Description'!H1015","v":0}]
[{"$f":"+'Project Description'!B1018","v":"Year 5"},null,null,null,{"$f":"+'Project Description'!H1018","v":0}]
[{"$f":"+'Project Description'!B1019","v":"Year 10"},null,null,null,{"$f":"+'Project Description'!H1019","v":0}]
[{"$f":"+'Project Description'!B1020","v":"Year 15"},null,null,null,{"$f":"+'Project Description'!H1020","v":0}]
[{"$f":"+'Project Description'!B1021","v":"Year 20"},null,null,null,{"$f":"+'Project Description'!H1021","v":0}]
[{"$f":"+'Project Description'!B1022","v":"Year 25"},null,null,null,{"$f":"+'Project Description'!H1022","v":0}]
[{"$f":"+'Project Description'!B1023","v":"Year 30"},null,null,null,{"$f":"+'Project Description'!H1023","v":0}]
[{"$f":"+'Project Description'!B1024","v":"Year 35"},null,null,null,{"$f":"+'Project Description'!H1024","v":0}]
[]
[]
["Applicant's Additional Explanation:"]
[]
[{"$f":"+'Project Description'!B1065","v":0}]

{"sheet":"Checklist","index":15,"n_rows":445,"n_cols":21,"rows_kept":445,"cut":false,"hidden":false,"merged":[[395,5,395,18],[392,5,392,18],[392,0,392,1],[322,0,322,1],[325,0,325,1],[328,0,328,1],[300,0,300,1],[229,0,229,1],[282,0,282,1],[265,0,265,1],[271,0,271,1],[274,0,274,1],[279,0,279,1],[251,0,251,1],[256,0,256,1],[259,0,259,1],[312,0,312,1],[389,5,389,18],[378,5,378,18],[309,0,309,1],[303,0,303,1],[306,0,306,1],[319,0,319,1],[386,5,386,18],[60,0,60,1],[63,0,63,1],[66,0,66,1],[69,0,69,1],[72,0,72,1],[102,0,102,1],[105,0,105,1],[108,0,108,1],[411,5,411,18],[408,5,408,18],[408,0,408,1],[218,8,218,19],[212,8,212,19],[170,0,170,1],[173,0,173,1],[176,0,176,1],[179,0,179,1],[182,0,182,1],[185,0,185,1],[188,0,188,1],[191,0,191,1],[194,0,194,1],[268,0,268,1],[297,0,297,1],[27,0,27,1],[152,0,152,1],[155,0,155,1],[158,0,158,1],[161,0,161,1],[111,0,111,1],[221,0,221,1],[90,0,90,1],[93,0,93,1],[96,0,96,1],[99,0,99,1],[75,0,75,1],[78,0,78,1],[81,0,81,1],[84,0,84,1],[87,0,87,1],[30,0,30,1],[33,0,33,1],[36,0,36,1],[39,0,39,1],[42,0,42,1],[45,0,45,1],[51,0,51,1],[54,0,54,1],[441,0,441,1],[355,0,355,1],[358,0,358,1],[331,0,331,1],[334,0,334,1],[337,0,337,1],[340,0,340,1],[346,0,346,1],[361,0,361,1],[364,0,364,1],[367,0,367,1],[370,0,370,1],[383,0,383,1],[386,0,386,1],[401,0,401,1],[349,0,349,1],[373,0,373,1],[343,0,343,1],[405,0,405,1],[389,0,389,1],[411,0,411,1],[417,0,417,1],[395,0,395,1],[57,0,57,1],[383,5,383,18],[325,5,325,18],[328,5,328,18],[331,5,331,18],[337,5,337,18],[341,5,341,18],[340,5,340,18],[206,0,206,1],[212,0,212,1],[209,0,209,1],[373,5,373,18],[376,5,376,18],[355,5,355,18],[367,5,367,18],[370,5,370,18],[358,5,358,18],[362,5,362,18],[361,5,361,18],[364,5,364,18],[241,0,241,1],[244,0,244,1],[232,0,232,1],[235,0,235,1],[262,0,262,1],[238,0,238,1],[114,0,114,1],[215,0,215,1],[218,0,218,1],[224,0,224,1],[164,0,164,1],[167,0,167,1],[117,0,117,1],[197,0,197,1],[200,0,200,1],[203,0,203,1],[120,0,120,1],[126,0,126,1],[132,0,132,1],[135,0,135,1],[141,0,141,1],[123,0,123,1],[138,0,138,1],[129,0,129,1],[3,0,3,1],[417,5,417,18],[420,0,420,1],[420,5,420,18],[423,0,423,1],[423,5,423,18],[398,5,398,18],[398,0,398,1],[414,5,414,18],[414,0,414,1],[405,5,405,18],[401,5,401,18],[402,5,402,18],[48,0,48,1],[346,5,346,18],[349,5,349,18],[343,5,343,18],[316,0,316,2],[378,0,378,1],[381,0,381,1],[381,5,381,18],[352,0,352,1],[376,0,376,1],[144,0,144,1]]}
[]
[]
[{"$f":"+Instructions!A3","v":"2025 QAP Underwriting Application v1.1"}]
[{"$f":"TRIM('Project Description'!E84)&\" (\"&TRIM('Project Description'!E86)&\" LA), \"&'Project Description'!E50","v":" ( LA), "}]
[]
["Checklist of Threshold Requirements and Other Required Information"]
[]
["Complete the Following Worksheets (Each Requires User Entries)"]
[null,"Project Description"]
[null,"Unit Mix and Rents"]
[null,"Development Costs"]
[null,"Basis Calculation"]
[null,"Revenues and Expenses"]
[null,"Development Team"]
[null,"Syndication"]
[null,"Taxpayer Certification"]
[null,"Reserve Adequacy"]
[null,"Developer Experience (LHC-3)"]
[null,"Property Management Experience (LHC-4)"]
[null,"Appendix 1 (Ownership Information)"]
[null,"Appendix 2 (Site Control Worksheet)"]
[null,"Appendix 4 (Zoning Evidence)"]
[]
["If user entries are required in other worksheets, instructions will appear below."]
[]
["Threshold Requirements",null,"QAP References"]
[]
["The Threshold Requirements described below are required for each item marked \"Yes\" in column A.  The 'QAP References' column provides a cross-reference to the appropriate portion(s) of the QAP."]
[]
["Yes",{"$f":"\"Threshold Requirement \"&E30&\": \"&F30&\".\"","v":"Threshold Requirement 1: Site Control (Also Appendix 2)."},{"$f":"+'QAP Reference'!A39","v":"IV.A.4"},null,1,"Site Control (Also Appendix 2)"]
["As specified in the QAP. Generally, a purchase agreement, option to purchase, executed ground lease, or valid title.  Label as Appendix 2 and include the worksheet in this Application titled 'Appendix 2'."]
[]
["Yes",{"$f":"\"Threshold Requirement \"&E33&\": \"&F33&\".\"","v":"Threshold Requirement 2: Zoning (Also Appendix 4)."},{"$f":"+'QAP Reference'!A40","v":"IV.A.5"},null,{"$f":"+E30+1","v":2},"Zoning (Also Appendix 4)"]
["As specified in the QAP. Documentation that development of the project is permitted under applicable zoning requirements.  Label as Appendix 4; the signed document from the zoning authority should conform to the format of the worksheet in this Application titled 'Appendix 4'."]
[]
["Yes",{"$f":"\"Threshold Requirement \"&E36&\": \"&F36&\".\"","v":"Threshold Requirement 3: Infrastructure (Also Appendix 38)."},{"$f":"+'QAP Reference'!A41","v":"IV.A.6"},null,{"$f":"+E33+1","v":3},"Infrastructure (Also Appendix 38)"]
["As specified in the QAP. Evidence of essential utilities, transportation, and educational facilities."]
[]
[{"$f":"IF('Project Description'!H100=\"Yes\",\"Yes\",\"\")","v":""},{"$f":"\"Threshold Requirement \"&E39&\": \"&F39&\".\"","v":"Threshold Requirement 4: Environmental Restrictions Checklist (Also Appendix 36)."},{"$f":"+'QAP Reference'!A42","v":"IV.A.7"},null,{"$f":"+E36+1","v":4},"Environmental Restrictions Checklist (Also Appendix 36)"]
["As specified in the QAP. Applicable to projects involving use of existing structures.  Include any Operations and Maintenance Plans called for in the Checklist.  The format for the Checklist is in the worksheet titled 'Appendix 36'."]
[]
["Yes",{"$f":"\"Threshold Requirement \"&E42&\": \"&F42&\".\"","v":"Threshold Requirement 5: Taxpayer Agreement Regarding Tenant Referrals (Also Appendix 39)."},{"$f":"+'QAP Reference'!A44","v":"IV.A.9"},null,{"$f":"+E39+1","v":5},"Taxpayer Agreement Regarding Tenant Referrals (Also Appendix 39)"]
["As specified in the QAP. "]
[]
["Yes",{"$f":"\"Threshold Requirement \"&E45&\": \"&F45&\".\"","v":"Threshold Requirement 6: Minimum Internet / Cable Capacity Requirements."},{"$f":"+'QAP Reference'!A45","v":"IV.A.10"},null,{"$f":"+E42+1","v":6},"Minimum Internet / Cable Capacity Requirements"]
["As specified in the QAP. Taxpayer agreement to comply with applicable QAP requirements."]
[]
["Yes",{"$f":"\"Threshold Requirement \"&E48&\": \"&F48&\".\"","v":"Threshold Requirement 7:  Amenities: On-site laundry or washers and dryers hookups installed."},{"$f":"+'QAP Reference'!A46","v":"IV.B.4"},null,{"$f":"+E45+1","v":7}," Amenities: On-site laundry or washers and dryers hookups installed"]
["As specified in the QAP. "]
[]
["Yes",{"$f":"\"Threshold Requirement \"&E51&\": \"&F51&\".\"","v":"Threshold Requirement 8: Energy Efficiency Requirements."},{"$f":"+'QAP Reference'!A47","v":"IV.A.11"},null,{"$f":"+E48+1","v":8},"Energy Efficiency Requirements"]
["As specified in the QAP. Requirements vary between new construction projects and rehabilitation projects.  See the QAP."]
[]
["Yes",{"$f":"\"Threshold Requirement \"&E54&\": \"&F54&\".\"","v":"Threshold Requirement 9: Design Features."},{"$f":"+'QAP Reference'!A48","v":"IV.A.12"},null,{"$f":"+E51+1","v":9},"Design Features"]
["As specified in the QAP: (1) 15-year-plus maintenance-free exterior; (2) 25-year-plus roof warranty; and (3) at least double paned, insulated windows."]
[]
[{"$f":"IF(AND('Project Description'!H114=\"Yes\",OR('Project Description'!H96=\"Yes\",'Project Description'!H104=\"Yes\")),\"Yes\",\"\")","v":""},{"$f":"\"Threshold Requirement \"&E57&\": \"&F57&\".\"","v":"Threshold Requirement 10: NC or SR Projects in Special Flood Hazard Areas."},{"$f":"+'QAP Reference'!A49","v":"IV.A.13"},null,{"$f":"+E54+1","v":10},"NC or SR Projects in Special Flood Hazard Areas"]
["As specified in the QAP.  Elevation to the minimum BFE. "]
[]
["Yes",{"$f":"\"Threshold Requirement \"&E60&\": \"&F60&\".\"","v":"Threshold Requirement 11: Compliance with Local Floodplain Management Requirements."},{"$f":"+'QAP Reference'!A49","v":"IV.A.13"},null,{"$f":"+E57+1","v":11},"Compliance with Local Floodplain Management Requirements"]
["As specified in the QAP.  Applies to all projects."]
[]
["Yes",{"$f":"\"Threshold Requirement \"&E63&\": \"&F63&\".\"","v":"Threshold Requirement 12: Floodplain Determination."},{"$f":"+'QAP Reference'!A49","v":"IV.A.13"},null,{"$f":"+E60+1","v":12},"Floodplain Determination"]
["All projects must provide a certification by the architect regarding whether all or part of the project lies in a floodplain.  If all or part of the project lies in a floodplain, two additional requirements apply: (1) a finished-construction elevation certificate must be provided; and (2) the architect's certification must indicate whether the finished-construction elevation is at or above the Base Flood Elevation."]
[]
[{"$f":"IF('Project Description'!H115=\"Yes\",\"Yes\",\"\")","v":""},{"$f":"\"Threshold Requirement \"&E66&\": \"&F66&\".\"","v":"Threshold Requirement 13: Architect's Certification for Levee Protected Areas."},{"$f":"+'QAP Reference'!A49","v":"IV.A.13"},null,{"$f":"+E63+1","v":13},"Architect's Certification for Levee Protected Areas"]
["As specified in the QAP, for any project located inside a levee protected area."]
[]
[{"$f":"IF('Project Description'!H101=\"Yes\",\"Yes\",\"\")","v":""},{"$f":"\"Threshold Requirement \"&E69&\": \"&F69&\".\"","v":"Threshold Requirement 14: Capital Needs Assessment (Also Appendix 6)."},{"$f":"+'QAP Reference'!A51","v":"IV.B.5"},null,{"$f":"+E66+1","v":14},"Capital Needs Assessment (Also Appendix 6)"]
["For all projects involving acquisition of any existing residential building, as specified in the QAP: a Capital Needs Assessment (labeled as Appendix 6).  Additional requirements apply to historic rehab projects."]
[]
[{"$f":"IF('Project Description'!H105=\"Yes\",\"Yes\",\"\")","v":""},{"$f":"\"Threshold Requirement \"&E72&\": \"&F72&\".\"","v":"Threshold Requirement 15: Historic Rehabilitation Projects."},{"$f":"+'QAP Reference'!A52","v":"IV.A.15"},null,{"$f":"+E69+1","v":15},"Historic Rehabilitation Projects"]
["(1) Evidence of compliance with various minimum project requirements as specified in the QAP. (2) Approved Part I application from the Louisiana Office of Cultural Development Division of Historic Preservation, plus a Part II by the carryover date. (3) Additional requirements apply if 'substantial improvement' (as defined under the NFIP) is taking place and the structure is not being elevated."]
[]
["Yes",{"$f":"\"Threshold Requirement \"&E75&\": \"&F75&\".\"","v":"Threshold Requirement 16: Minimum Score."},{"$f":"+'QAP Reference'!A55","v":"IV.A.18"},null,{"$f":"+E72+1","v":16},"Minimum Score"]
["Minimum selection criteria score of forty (40) points."]
[]
[{"$f":"IF('Project Description'!H110=\"Yes\",\"Yes\",\"\")","v":""},{"$f":"\"Threshold Requirement \"&E78&\": \"&F78&\".\"","v":"Threshold Requirement 17: Audited Financials of Project (Or Equivalent) from Seller."},{"$f":"+'QAP Reference'!A59","v":"IV.B.1"},null,{"$f":"+E75+1","v":17},"Audited Financials of Project (Or Equivalent) from Seller"]
["For projects including existing rental housing buildings. As specified in the QAP.  "]
[]
[{"$f":"IF('Project Description'!H111=\"Yes\",\"Yes\",\"\")","v":""},{"$f":"\"Threshold Requirement \"&E81&\": \"&F81&\".\"","v":"Threshold Requirement 18: Sales Price With Related Persons."},{"$f":"+'QAP Reference'!A60","v":"IV.B.2"},null,{"$f":"+E78+1","v":18},"Sales Price With Related Persons"]
["For projects where there is a relationship between seller and purchaser. As specified in the QAP.  "]
[]
["Yes",{"$f":"\"Threshold Requirement \"&E84&\": \"&F84&\".\"","v":"Threshold Requirement 19: Ten Year Title History (Also Appendix 3)."},{"$f":"+'QAP Reference'!A61","v":"IV.B.3"},null,{"$f":"+E81+1","v":19},"Ten Year Title History (Also Appendix 3)"]
["Applies to all projects, to help establish Land Cost as defined in the QAP. "]
[]
["Yes",{"$f":"\"Threshold Requirement \"&E87&\": \"&F87&\".\"","v":"Threshold Requirement 20: Organizational Chart for Taxpayer / Applicant."},null,null,{"$f":"+E84+1","v":20},"Organizational Chart for Taxpayer / Applicant"]
["Must include ownership percentages."]
[]
["Yes",{"$f":"\"Threshold Requirement \"&E90&\": \"&F90&\".\"","v":"Threshold Requirement 21: Developer Experience."},{"$f":"+'QAP Reference'!A62","v":"IV.C.1  "},null,{"$f":"+E87+1","v":21},"Developer Experience"]
["As specified in the QAP.  Evidence that the Managing General Partner or Sponsor meets the requirements of QAP V.C.1. "]
[]
["Yes",{"$f":"\"Threshold Requirement \"&E93&\": \"&F93&\".\"","v":"Threshold Requirement 22: Property Management Experience (Also Appendix 45)."},{"$f":"+'QAP Reference'!A64","v":"V.C.2"},null,{"$f":"+E90+1","v":22},"Property Management Experience (Also Appendix 45)"]
["As specified in the QAP.  Evidence that the property management firm meets the requirements of QAP V.C.2. "]
[]
[{"$f":"IF('Project Description'!H66=\"Yes\",\"Yes\",\"\")","v":""},{"$f":"\"Threshold Requirement \"&E96&\": \"&F96&\".\"","v":"Threshold Requirement 23: Development Team Member \"Not in Good Standing\"."},{"$f":"+'QAP Reference'!A66","v":"V.C.3"},null,{"$f":"+E93+1","v":23},"Development Team Member \"Not in Good Standing\""]
["In this Application, you indicated that a member of the development team is \"not in good standing\" with the LHC. Please provide a complete discussion. "]
[]
["Yes",{"$f":"\"Threshold Requirement \"&E99&\": \"&F99&\".\"","v":"Threshold Requirement 24: Local Community Notification (Also Appendix 37)."},{"$f":"+'QAP Reference'!A67","v":"III.A"},null,{"$f":"+E96+1","v":24},"Local Community Notification (Also Appendix 37)"]
["As specified in the QAP, labeled as Appendix 37.  (1) Proof of public notice.  (2) Proof of notice to CEOs of local governing authorities.  Notices must  contain all information specified in the QAP."]
[]
[{"$f":"IF(AND('Unit Mix and Rents'!AO41=0,'Unit Mix and Rents'!AP41=0),\"\",\"Yes\")","v":""},{"$f":"\"Threshold Requirement \"&E102&\": \"&F102&\".\"","v":"Threshold Requirement 25: Failure to Meet Minimum Unit Size / Bathroom Requirements."},{"$f":"+'QAP Reference'!A68","v":"Appendix B"},null,{"$f":"+E99+1","v":25},"Failure to Meet Minimum Unit Size / Bathroom Requirements"]
["In this Application, one or more unit types failed to meet the minimum requirements of the QAP; see the Unit Mix and Rents worksheet. As specified in the QAP, a waiver may be required, or a certification from the local jurisdiction, as applicable."]
[]
[{"$f":"IF('Development Costs'!F255>1,\"Yes\",\"\")","v":{"$error":"#N/A"}},{"$f":"\"Threshold Requirement \"&E105&\": \"&F105&\".\"","v":"Threshold Requirement 26: Failure to Meet Maximum Unit Development Cost Requirements."},{"$f":"+'QAP Reference'!A69","v":"IV.D"},null,{"$f":"+E102+1","v":26},"Failure to Meet Maximum Unit Development Cost Requirements"]
["In this Application, the total development cost exceeded the maximum TDC limitation under the QAP. The QAP allows various options and exceptions."]
[]
["Yes",{"$f":"\"Threshold Requirement \"&E108&\": \"&F108&\".\"","v":"Threshold Requirement 27: Construction and Design Standards."},{"$f":"+'QAP Reference'!A74","v":"Appendix B"},null,{"$f":"+E105+1","v":27},"Construction and Design Standards"]
["As specified in the QAP. Architect's Certifications that the proposed development complies with QAP requirements. "]
[]
["Yes",{"$f":"\"Threshold Requirement \"&E111&\": \"&F111&\".\"","v":"Threshold Requirement 28: Project Amenities (Also Appendix 29)."},{"$f":"+'QAP Reference'!A75","v":"Appendix B"},null,{"$f":"+E108+1","v":28},"Project Amenities (Also Appendix 29)"]
["As specified in the QAP. (1) HVAC systems, refrigerators, stoves.  (2) All amenities (except laundry) available to tenants at no additional charge. (3) On-site laundry meeting QAP requirements. Some exceptions for SROs and for rehabilitation projects of twelve or fewer units."]
[]
[{"$f":"IF('Development Costs'!J142=0,\"\",\"Yes\")","v":""},{"$f":"\"Threshold Requirement \"&E114&\": \"&F114&\".\"","v":"Threshold Requirement 29: One or More Violations of Fee and Profit Limits (Also Appendix 8)."},{"$f":"+'QAP Reference'!A76","v":"IV.D"},null,{"$f":"+E111+1","v":29},"One or More Violations of Fee and Profit Limits (Also Appendix 8)"]
["See the Development Costs worksheet.  Either reduce the affected amount(s), or (if you believe a waiver is justified) submit a signed letter (labeled as Appendix 8) requesting an appropriate waiver. "]
[]
["Yes",{"$f":"\"Threshold Requirement \"&E117&\": \"&F117&\".\"","v":"Threshold Requirement 30: Developer Certification of Sources and Uses."},{"$f":"+'QAP Reference'!A34","v":"IV.D.12"},null,{"$f":"+E114+1","v":30},"Developer Certification of Sources and Uses"]
["As specified in the QAP.  There is no specific required format for this certification."]
[]
["Yes",{"$f":"\"Threshold Requirement \"&E120&\": \"&F120&\".\"","v":"Threshold Requirement 31: Resiliency Standards - Projects Located in Tier 1 or Tier 2 Parishes."},{"$f":"+'QAP Reference'!A36","v":"IV.A.1"},null,{"$f":"+E117+1","v":31},"Resiliency Standards - Projects Located in Tier 1 or Tier 2 Parishes"]
["As specified in the QAP. "]
[]
[{"$f":"IF('Project Description'!H96=\"Yes\",\"Yes\",\"\")","v":""},{"$f":"\"Threshold Requirement \"&E123&\": \"&F123&\".\"","v":"Threshold Requirement 32: Resiliency Standards - Resiliency Standards (New Construction Only)."},{"$f":"+'QAP Reference'!A37","v":"IV.A.2"},null,{"$f":"+E120+1","v":32},"Resiliency Standards - Resiliency Standards (New Construction Only)"]
["As specified in the QAP. "]
[]
["Yes",{"$f":"\"Threshold Requirement \"&E126&\": \"&F126&\".\"","v":"Threshold Requirement 33: Legal Description."},{"$f":"+'QAP Reference'!A54","v":"IV.A.17"},null,{"$f":"+E123+1","v":33},"Legal Description"]
["As specified in the QAP."]
[]
["Yes",{"$f":"\"Threshold Requirement \"&E129&\": \"&F129&\".\"","v":"Threshold Requirement 34: Map."},{"$f":"+'QAP Reference'!A54","v":"IV.A.17"},null,{"$f":"+E126+1","v":34},"Map"]
["As specified in the QAP."]
[]
["Yes",{"$f":"\"Threshold Requirement \"&E132&\": \"&F132&\".\"","v":"Threshold Requirement 35: Negative Neighoborhood Features."},{"$f":"+'QAP Reference'!A43","v":"IV.A.8"},null,{"$f":"+E129+1","v":35},"Negative Neighoborhood Features"]
["As specified in the QAP."]
[]
["Yes",{"$f":"\"Threshold Requirement \"&E135&\": \"&F135&\".\"","v":"Threshold Requirement 36: Development Wi-Fi."},{"$f":"+'QAP Reference'!A58","v":"IV.A.21"},null,{"$f":"+E132+1","v":36},"Development Wi-Fi"]
["As specified in the QAP."]
[]
["Yes",{"$f":"\"Threshold Requirement \"&E138&\": \"&F138&\".\"","v":"Threshold Requirement 37: LIHTC Compliance Training."},{"$f":"+'QAP Reference'!A57","v":"IV.A.20"},null,{"$f":"+E135+1","v":37},"LIHTC Compliance Training"]
["As specified in the QAP."]
[]
["Yes",{"$f":"\"Threshold Requirement \"&E141&\": \"&F141&\".\"","v":"Threshold Requirement 38: 30% AMI and Target Population."},{"$f":"+'QAP Reference'!A38","v":"IV.A.3"},null,{"$f":"+E138+1","v":38},"30% AMI and Target Population"]
["As specified in the QAP."]
[]
["Yes",{"$f":"\"Threshold Requirement \"&E144&\": \"&F144&\".\"","v":"Threshold Requirement : Signed Documents."},null,null,null,"Signed Documents"]
["The following documents need to be signed by the Taxpayer (and, where noted, notarized): Financing Certification (notarized), Syndication Certification (signed by Taxpayer and Syndicator, both notarized), Taxpayer Certification (notarized), Appendix 1 (notarized), Appendix 4, Appendix 34, Appendix 35, Appendix 36 (signed by preparer), LHC-3, and LHC-4.",null,null,null,null,"QUESTION ON APP 35"]
[]
[]
[]
[]
[]
["Appendices",null,"QAP References"]
[]
["Below is a comprehensive list of Attachments. Those marked 'Yes' in column A are required for this application."]
[]
["Yes",{"$f":"\"Appendix \"&E155&\": \"&F155&\".\"","v":"Appendix 1: Ownership Information."},null,null,{"$f":"+E152+1","v":1},"Ownership Information"]
["The Ownership Information format is in the worksheet in this Application titled 'Appendix 1'."]
[]
[{"$f":"A30","v":"Yes"},{"$f":"\"Appendix \"&E158&\": \"&F158&IF(J158=\"\",\".\",\" (see Threshold Requirement \"&J158&\").\")","v":"Appendix 2: Site Control (see Threshold Requirement 1)."},{"$f":"+'QAP Reference'!A39","v":"IV.A.4"},null,{"$f":"+E155+1","v":2},"Site Control",null,null,null,{"$f":"+E30","v":1}]
["The materials required for this Appendix are described above in the Threshold Requirements section."]
[]
["Yes",{"$f":"\"Appendix \"&E161&\": \"&F161&IF(J161=\"\",\".\",\" (see Threshold Requirement \"&J161&\").\")","v":"Appendix 3: Ownership History (see Threshold Requirement 19)."},{"$f":"+C84","v":"IV.B.3"},null,{"$f":"+E158+1","v":3},"Ownership History",null,null,null,{"$f":"+E84","v":19}]
["The materials required for this Appendix are described above in the Threshold Requirements section."]
[]
["Yes",{"$f":"\"Appendix \"&E164&\": \"&F164&IF(J164=\"\",\".\",\" (see Threshold Requirement \"&J164&\").\")","v":"Appendix 4: Zoning (see Threshold Requirement 2)."},{"$f":"+C33","v":"IV.A.5"},null,{"$f":"+E161+1","v":4},"Zoning",null,null,null,{"$f":"+E33","v":2}]
["The materials required for this Appendix are described above in the Threshold Requirements section."]
[]
[{"$f":"IF('Project Description'!H103=\"Yes\",\"Yes\",\"\")","v":""},{"$f":"\"Appendix \"&E167&\": \"&F167&IF(J167=\"\",\".\",\" (see Threshold Requirement \"&J167&\").\")","v":"Appendix 5: Appraisal."},{"$f":"+'QAP Reference'!A82","v":"IV.B.6"},null,{"$f":"+E164+1","v":5},"Appraisal"]
["For rehabilitation projects, as specified in the QAP.  The appraisal is to establish the fair market value of any existing property when the purchase price exceeds 500,000 or the Acquisition Costs of buildings are included in eligible basis.  Appraisals must be dated within 90 days of submission of the Application. "]
[]
[{"$f":"+A69","v":""},{"$f":"\"Appendix \"&E170&\": \"&F170&IF(J170=\"\",\".\",\" (see Threshold Requirement \"&J170&\").\")","v":"Appendix 6: Capital Needs Assessment (see Threshold Requirement 14)."},{"$f":"+'QAP Reference'!A51","v":"IV.B.5"},null,{"$f":"+E167+1","v":6},"Capital Needs Assessment",null,null,null,{"$f":"+E69","v":14}]
["The materials required for this Appendix are described above in the Threshold Requirements section."]
[]
["Yes",{"$f":"\"Appendix \"&E173&\": \"&F173&IF(J173=\"\",\".\",\" (see Threshold Requirement \"&J173&\").\")","v":"Appendix 7: Financing Commitments."},{"$f":"+'QAP Reference'!A81","v":"V.H NA"},null,{"$f":"+E170+1","v":7},"Financing Commitments"]
["Financing commitments must be fully executed."]
[]
[{"$f":"+A114","v":""},{"$f":"\"Appendix \"&E176&\": \"&F176&IF(J176=\"\",\".\",\" (see Threshold Requirement \"&J176&\").\")","v":"Appendix 8: Waiver of Profit Limits (see Threshold Requirement 29)."},{"$f":"+'QAP Reference'!A76","v":"IV.D"},null,{"$f":"+E173+1","v":8},"Waiver of Profit Limits",null,null,null,{"$f":"+E114","v":29}]
["The materials required for this Appendix are described above in the Threshold Requirements section."]
[]
["Yes",{"$f":"\"Appendix \"&E179&\": \"&F179&IF(J179=\"\",\".\",\" (see Threshold Requirement \"&J179&\").\")","v":"Appendix 9: Development Services Agreement."},{"$f":"+'QAP Reference'!A77","v":"IV.D"},null,{"$f":"+E176+1","v":9},"Development Services Agreement"]
["The Development Services Agreement must be fully executed."]
[]
[{"$f":"IF('Project Description'!H40=\"Yes\",\"Yes\",\"\")","v":""},{"$f":"\"Appendix \"&E182&\": \"&F182&IF(J182=\"\",\".\",\" (see Threshold Requirement \"&J182&\").\")","v":"Appendix 10: Federal Agency Letter."},{"$f":"+'QAP Reference'!A80","v":"IV.A"},null,{"$f":"+E179+1","v":10},"Federal Agency Letter"]
["A Federal Agency Provides Federal Funding or Mortgage Insurance.  Please provide a signed letter from the agency advising that the agency has no objections to the reservation of tax credits / LHC Funds to the project."]
[]
[{"$f":"IF('Project Description'!M177=1,\"Yes\",\"\")","v":{"$error":"#N/A"}},{"$f":"\"Appendix \"&E185&\": \"&F185&IF(J185=\"\",\".\",\" (see Threshold Requirement \"&J185&\").\")","v":"Appendix 11: Non-Profit Participation."},{"$f":"+'QAP Reference'!A9","v":"II.A"},null,{"$f":"+E182+1","v":11},"Non-Profit Participation"]
["The Non-Profit Participation Information format is in the worksheet in this Application titled 'Appendix 11'.",null,null,null,null,"Confirm when App 11 is required; all QNP/CHDO Pool apps?  Something else?"]
[]
[{"$f":"IF('Project Description'!M177=1,\"Yes\",\"\")","v":{"$error":"#N/A"}},{"$f":"\"Appendix \"&E188&\": \"&F188&IF(J188=\"\",\".\",\" (see Threshold Requirement \"&J188&\").\")","v":"Appendix 12: Non-Profit IRS Determination Letter."},{"$f":"+'QAP Reference'!A9","v":"II.A"},null,{"$f":"+E185+1","v":12},"Non-Profit IRS Determination Letter"]
["IRS letter establishing the 501(c)(3) or 501(c)(4) status of the Qualified Non-Profit Organization."]
[]
[{"$f":"IF('Project Description'!M177=1,\"Yes\",\"\")","v":{"$error":"#N/A"}},{"$f":"\"Appendix \"&E191&\": \"&F191&IF(J191=\"\",\".\",\" (see Threshold Requirement \"&J191&\").\")","v":"Appendix 13: Non-Profit Counsel's Opinion."},{"$f":"+'QAP Reference'!A9","v":"II.A"},null,{"$f":"+E188+1","v":13},"Non-Profit Counsel's Opinion"]
["The format for the counsel's opinion is in the worksheet in this Application titled 'Appendix 13'."]
[]
[{"$f":"IF('Project Description'!M177=1,\"Yes\",\"\")","v":{"$error":"#N/A"}},{"$f":"\"Appendix \"&E194&\": \"&F194&IF(J194=\"\",\".\",\" (see Threshold Requirement \"&J194&\").\")","v":"Appendix 14: Non-Profit Articles and By-Laws."},{"$f":"+'QAP Reference'!A9","v":"II.A"},null,{"$f":"+E191+1","v":14},"Non-Profit Articles and By-Laws"]
[]
[]
[{"$f":"IF('Project Description'!H73=\"Yes\",\"Yes\",\"\")","v":""},{"$f":"\"Appendix \"&E197&\": \"&F197&IF(J197=\"\",\".\",\" (see Threshold Requirement \"&J197&\").\")","v":"Appendix 15: CHDO Approval Letter."},{"$f":"+'QAP Reference'!A10","v":"II.A"},null,{"$f":"+E194+1","v":15},"CHDO Approval Letter"]
[{"$f":"IF(A197=\"Yes\",\"Please submit a letter from the HOME Participating Jurisdiction, certifying the applicant as a CHDO.\",\"\")","v":""}]
[]
[null,{"$f":"\"Appendix \"&E200&\": \"&F200&IF(J200=\"\",\".\",\" (see Threshold Requirement \"&J200&\").\")","v":"Appendix 16: Not Applicable to This QAP."},null,null,{"$f":"+E197+1","v":16},"Not Applicable to This QAP",null,null,"RD Rural Rehab"]
[]
[]
[{"$f":"IF('Selection Criteria'!D10=0,\"\",\"Yes\")","v":""},{"$f":"\"Appendix \"&E203&\": \"&F203&IF(J203=\"\",\".\",\" (see Threshold Requirement \"&J203&\").\")","v":"Appendix 17: Points Claimed for Geographic Diversity - Not Applicable to the 2025 QAP."},{"$f":"+'QAP Reference'!A90","v":"Appendix A.I.A.ii"},null,{"$f":"+E200+1","v":17},"Points Claimed for Geographic Diversity - Not Applicable to the 2025 QAP"]
["Please submit documentation called for in the QAP, regarding information about median incomes in (1) the census tract in which the project is located and (2) the MSA."]
[]
[{"$f":"IF(SUM('Selection Criteria'!D13:D20)=0,\"\",\"Yes\")","v":""},{"$f":"\"Appendix \"&E206&\": \"&F206&IF(J206=\"\",\".\",\" (see Threshold Requirement \"&J206&\").\")","v":"Appendix 18: Points Claimed for Redevelopment Project."},{"$f":"+'QAP Reference'!B91","v":"Redevelopment Project"},null,{"$f":"+E203+1","v":18},"Points Claimed for Redevelopment Project"]
["Please submit documentation called for in the QAP, demonstrating that the project qualifies as a Redevelopment Project (either Distressed Property, Redevelopment Property, or Owner Occupied Property with Development Plan of Action) under Selection Criterion I.B."]
[]
["Yes",{"$f":"\"Appendix \"&E209&\": \"&F209&IF(J209=\"\",\".\",\" (see Threshold Requirement \"&J209&\").\")","v":"Appendix 19: Points Claimed in Rehabilitation & Preservation and/or New Construction."},null,null,{"$f":"+E206+1","v":19},"Points Claimed in Rehabilitation & Preservation and/or New Construction"]
["Please submit documentation called for in the QAP, demonstrating that the project qualifies for all points claimed under Selection Criterion I.B Rehabilitation & Preservation and/or I.C New Construction."]
[]
[{"$f":"IF('Project Description'!H92=\"No\",\"Yes\",\"\")","v":""},{"$f":"\"Appendix \"&E212&\": \"&F212&IF(J212=\"\",\".\",\" (see Threshold Requirement \"&J212&\").\")","v":"Appendix 20: Scattered-Site Project."},"Glossary",null,{"$f":"+E209+1","v":20},"Scattered-Site Project"]
[{"$f":"IF(A212=\"Yes\",I213,\"\")","v":""},null,null,null,null,null,null,null,"In this Application, you indicated that this is a multi-site project.  (1) Provide documentation that the project satisfies the QAP requirements in the Glossary's definition of 'Scattered-Site Project'. (2) Include information adequate to identify each site, including (at a minimum) the street address and a location map for each site.  (3) Indicate the unit mix and square footage proposed for each site. (4) Indicate the type of development activity (new construction and/or rehab) that will take place at each site. (5) Indicate the total development cost for each site. (6) Indicate whether any of the multiple sites are 'contiguous' (adjacent, or separated only by a roadway).  (7) If you are claiming the 30% Basis Boost, provide documentation that 100% of the project sites qualify for the Basis Boost (see FAQ 14)."]
[]
[{"$f":"IF('Project Description'!H157=\"Yes\",\"Yes\",\"\")","v":""},{"$f":"\"Appendix \"&E215&\": \"&F215&IF(J215=\"\",\".\",\" (see Threshold Requirement \"&J215&\").\")","v":"Appendix 21: Preservation Property."},"Glossary",null,{"$f":"+E212+1","v":21},"Preservation Property"]
["Please submit documentation that the project meets the QAP's definition for \"Preservation Property\".  "]
[]
[{"$f":"IF(OR('Project Description'!F808=\"Yes\",'Project Description'!F809=\"Yes\",'Project Description'!F810=\"Yes\",'Project Description'!F811=\"Yes\"),\"Yes\",\"\")","v":""},{"$f":"\"Appendix \"&E218&\": \"&F218&IF(J218=\"\",\".\",\" (see Threshold Requirement \"&J218&\").\")","v":"Appendix 22: Special Needs Project (Non-Elderly)."},{"$f":"+'QAP Reference'!A92","v":"Appendix A.II.A.i"},null,{"$f":"+E215+1","v":22},"Special Needs Project (Non-Elderly)"]
[{"$f":"Checklist!I219&'Project Description'!A807&\".\"","v":"Please provide (a) Description of Supportive Services tailored to each Special Needs Household (see the Supportive Services definitions in the Glossary); (b) Cost per annum of Supportive Services per Special Needs Household or written commitment from governmental or non-profit agency that Supportive Services will be provided to Project without cost; (c) Experience of Taxpayer/Owner in developing Projects servicing Special Needs Households; and (d) documentation of your commitment to set aside the number of units specified in Section 24.02."},null,null,null,null,null,null,null,"Please provide (a) Description of Supportive Services tailored to each Special Needs Household (see the Supportive Services definitions in the Glossary); (b) Cost per annum of Supportive Services per Special Needs Household or written commitment from governmental or non-profit agency that Supportive Services will be provided to Project without cost; (c) Experience of Taxpayer/Owner in developing Projects servicing Special Needs Households; and (d) documentation of your commitment to set aside the number of units specified in Section "]
[]
[{"$f":"IF('Selection Criteria'!H48+'Selection Criteria'!H49=0,\"\",\"Yes\")","v":""},{"$f":"\"Appendix \"&E221&\": \"&F221&IF(J221=\"\",\".\",\" (see Threshold Requirement \"&J221&\").\")","v":"Appendix 23: Points Claimed for Increased Unit Affordability - Not applicaliable to 2025 QAP."},"VII.II.B.1",null,{"$f":"+E218+1","v":23},"Points Claimed for Increased Unit Affordability - Not applicaliable to 2025 QAP"]
["Please provide evidence of PSH, rental subsidy, or other means of maintaining the proposed level of affordability for these units."]
[]
[{"$f":"IF('Project Description'!M218=\"Boost\",\"Yes\",\"\")","v":""},{"$f":"\"Appendix \"&E224&\": \"&F224&IF(J224=\"\",\".\",\" (see Threshold Requirement \"&J224&\").\")","v":"Appendix 24: Basis Boost."},{"$f":"+'QAP Reference'!A19","v":"II.C"},null,{"$f":"+E221+1","v":24},"Basis Boost"]
["In this Application, you indicated you were requesting the 30% Basis Boost. Please provide documentation establishing that the project's location satisfies applicable QAP requirements."]
[]
[null,{"$f":"\"Appendix \"&E227&\": \"&F227&IF(J227=\"\",\".\",\" (see Threshold Requirement \"&J227&\").\")","v":"Appendix 25: Not Applicable to This QAP."},null,null,{"$f":"+E224+1","v":25},"Not Applicable to This QAP"]
[]
[{"$f":"IF('Project Description'!H819=\"Yes\",\"Yes\",\"\")","v":""},{"$f":"\"Appendix \"&E229&\": \"&F229&IF(J229=\"\",\".\",\" (see Threshold Requirement \"&J229&\").\")","v":"Appendix 26: Points Claimed for Additional Financial Support."},{"$f":"+'QAP Reference'!A98","v":"Appendix A.III.D"},null,{"$f":"+E227+1","v":26},"Points Claimed for Additional Financial Support"]
["Please document the amount and type of Additional Financial Support in accordance with applicable QAP Requirements. "]
[]
[{"$f":"IF('Selection Criteria'!G82=0,\"\",\"Yes\")","v":""},{"$f":"\"Appendix \"&E232&\": \"&F232&IF(J232=\"\",\".\",\" (see Threshold Requirement \"&J232&\").\")","v":"Appendix 27: Points Claimed for Green Building - N/A for 2025 QAP."},{"$f":"+'QAP Reference'!A102","v":"Appendix A.V.B.iv"},null,{"$f":"+E229+1","v":27},"Points Claimed for Green Building - N/A for 2025 QAP"]
["Please submit documentation that the project meets the Green Building definition in the Glossary. "]
[]
[{"$f":"IF('Selection Criteria'!D74=0,\"\",\"Yes\")","v":""},{"$f":"\"Appendix \"&E235&\": \"&F235&IF(J235=\"\",\".\",\" (see Threshold Requirement \"&J235&\").\")","v":"Appendix 28: Community Facilities."},{"$f":"+'QAP Reference'!A100","v":"Appendix A.V.A"},null,{"$f":"+E232+1","v":28},"Community Facilities"]
["Please submit documentation that the project includes Community Facilities as defined in the Glossary. "]
[]
["Yes",{"$f":"\"Appendix \"&E238&\": \"&F238&IF(J238=\"\",\".\",\" (see Threshold Requirement \"&J238&\").\")","v":"Appendix 29: Project Amenities (see Threshold Requirement 28)."},{"$f":"+C111","v":"Appendix B"},null,{"$f":"+E235+1","v":29},"Project Amenities",null,null,null,{"$f":"+E111","v":28}]
["The materials required for this Appendix are described above in the Threshold Requirements section."]
[]
[{"$f":"IF('Selection Criteria'!D89=0,\"\",\"Yes\")","v":""},{"$f":"\"Appendix \"&E241&\": \"&F241&IF(J241=\"\",\".\",\" (see Threshold Requirement \"&J241&\").\")","v":"Appendix 30: Points Claimed for Additional Accessible Units."},{"$f":"+'QAP Reference'!A104","v":"Appendix A.V.D"},null,{"$f":"+E238+1","v":30},"Points Claimed for Additional Accessible Units"]
[{"$f":"\"Please submit documentation that the units described in Sections \"&F242&\" and \"&G242&\" of this Application as being 'accessible' meet all applicable requirements under the Rehabilitation Act of 1973.\"","v":"Please submit documentation that the units described in Sections 27.06 and 27.07 of this Application as being 'accessible' meet all applicable requirements under the Rehabilitation Act of 1973."},null,null,null,null,{"$f":"+'Project Description'!A910","v":27.060000000000009},{"$f":"+'Project Description'!A913","v":27.070000000000011}]
[]
[{"$f":"IF('Selection Criteria'!D68=0,\"\",\"Yes\")","v":""},{"$f":"\"Appendix \"&E244&\": \"&F244&IF(J244=\"\",\".\",\" (see Threshold Requirement \"&J244&\").\")","v":"Appendix 31: Points Claimed for On-Site Security."},{"$f":"+'QAP Reference'!A105","v":"Appendix A.V.E"},null,{"$f":"+E241+1","v":31},"Points Claimed for On-Site Security"]
["Please submit documentation that the project meets the On-Site Security definition in the Glossary. "]
[]
[null,{"$f":"\"Appendix \"&E247&\": \"&F247&IF(J247=\"\",\".\",\" (see Threshold Requirement \"&J247&\").\")","v":"Appendix 32: Not Applicable to This QAP."},null,null,{"$f":"+E244+1","v":32},"Not Applicable to This QAP"]
[]
[null,{"$f":"\"Appendix \"&E249&\": \"&F249&IF(J249=\"\",\".\",\" (see Threshold Requirement \"&J249&\").\")","v":"Appendix 33: Not Applicable to This QAP."},null,null,{"$f":"+E247+1","v":33},"Not Applicable to This QAP",null,null,"Was documentation of TDC at least 15% below max"]
[]
["Yes",{"$f":"\"Appendix \"&E251&\": \"&F251&IF(J251=\"\",\".\",\" (see Threshold Requirement \"&J251&\").\")","v":"Appendix 34: Certification Regarding Debarment."},null,null,{"$f":"+E249+1","v":34},"Certification Regarding Debarment"]
["The format is in the worksheet in this Application titled 'Appendix 34'. The certification must be signed."]
[]
[null,{"$f":"\"Appendix \"&E254&\": \"&F254&IF(J254=\"\",\".\",\" (see Threshold Requirement \"&J254&\").\")","v":"Appendix 35: Not Applicable to This QAP."},null,null,{"$f":"+E251+1","v":35},"Not Applicable to This QAP",null,null,"Was 'Matching Certification'"]
[]
[{"$f":"+A39","v":""},{"$f":"\"Appendix \"&E256&\": \"&F256&IF(J256=\"\",\".\",\" (see Threshold Requirement \"&J256&\").\")","v":"Appendix 36: Environmental Restrictions Checklist (see Threshold Requirement 4)."},{"$f":"+C39","v":"IV.A.7"},null,{"$f":"+E254+1","v":36},"Environmental Restrictions Checklist",null,null,null,{"$f":"+E39","v":4}]
["The materials required for this Appendix are described above in the Threshold Requirements section."]
[]
["Yes",{"$f":"\"Appendix \"&E259&\": \"&F259&IF(J259=\"\",\".\",\" (see Threshold Requirement \"&J259&\").\")","v":"Appendix 37: Local Community Notification (see Threshold Requirement 24)."},{"$f":"+C99","v":"III.A"},null,{"$f":"+E256+1","v":37},"Local Community Notification",null,null,null,{"$f":"+E99","v":24}]
["The materials required for this Appendix are described above in the Threshold Requirements section."]
[]
["Yes",{"$f":"\"Appendix \"&E262&\": \"&F262&IF(J262=\"\",\".\",\" (see Threshold Requirement \"&J262&\").\")","v":"Appendix 38: Infrastructure (see Threshold Requirement 3)."},{"$f":"+C36","v":"IV.A.6"},null,{"$f":"+E259+1","v":38},"Infrastructure",null,null,null,{"$f":"+E36","v":3}]
["The materials required for this Appendix are described above in the Threshold Requirements section."]
[]
["Yes",{"$f":"\"Appendix \"&E265&\": \"&F265&IF(J265=\"\",\".\",\" (see Threshold Requirement \"&J265&\").\")","v":"Appendix 39: Tenant Referrals Agreement (see Threshold Requirement 5)."},{"$f":"+C42","v":"IV.A.9"},null,{"$f":"+E262+1","v":39},"Tenant Referrals Agreement",null,null,null,{"$f":"+E42","v":5}]
["The materials required for this Appendix are described above in the Threshold Requirements section."]
[]
["Yes",{"$f":"\"Appendix \"&E268&\": \"&F268&IF(J268=\"\",\".\",\" (see Threshold Requirement \"&J268&\").\")","v":"Appendix 40: Minimum Internet / Cable (see Threshold Requirement 6)."},{"$f":"+C45","v":"IV.A.10"},null,{"$f":"+E265+1","v":40},"Minimum Internet / Cable",null,null,null,{"$f":"+E45","v":6}]
["The materials required for this Appendix are described above in the Threshold Requirements section."]
[]
["Yes",{"$f":"\"Appendix \"&E271&\": \"&F271&IF(J271=\"\",\".\",\" (see Threshold Requirement \"&J271&\").\")","v":"Appendix 41: Energy Efficiency Requirements (see Threshold Requirement 8)."},{"$f":"+C51","v":"IV.A.11"},null,{"$f":"+E268+1","v":41},{"$f":"+F51","v":"Energy Efficiency Requirements"},null,null,null,{"$f":"+E51","v":8}]
["The materials required for this Appendix are described above in the Threshold Requirements section."]
[]
["Yes",{"$f":"\"Appendix \"&E274&\": \"&F274&IF(J274=\"\",\".\",\" (see Threshold Requirement \"&J274&\").\")","v":"Appendix 42: Design Features (see Threshold Requirement 9)."},{"$f":"+C54","v":"IV.A.12"},null,{"$f":"+E271+1","v":42},{"$f":"+F54","v":"Design Features"},null,null,null,{"$f":"+E54","v":9}]
["The materials required for this Appendix are described above in the Threshold Requirements section."]
[]
[null,{"$f":"\"Appendix \"&E277&\": \"&F277&IF(J277=\"\",\".\",\" (see Threshold Requirement \"&J277&\").\")","v":"Appendix 43: Not Applicable to This QAP."},null,null,{"$f":"+E274+1","v":43},"Not Applicable to This QAP",null,null,"Was documentation related to BFE; now obsolete"]
[]
[{"$f":"+A72","v":""},{"$f":"\"Appendix \"&E279&\": \"&F279&IF(J279=\"\",\".\",\" (see Threshold Requirement \"&J279&\").\")","v":"Appendix 44: Historic Rehabilitation Projects (see Threshold Requirement 15)."},{"$f":"+C72","v":"IV.A.15"},null,{"$f":"+E277+1","v":44},{"$f":"+F72","v":"Historic Rehabilitation Projects"},null,null,null,{"$f":"+E72","v":15}]
["The materials required for this Appendix are described above in the Threshold Requirements section."]
[]
["Yes",{"$f":"\"Appendix \"&E282&\": \"&F282&IF(J282=\"\",\".\",\" (see Threshold Requirement \"&J282&\").\")","v":"Appendix 45: Property Management Experience (Also Appendix 45) (see Threshold Requirement 22)."},{"$f":"+C93","v":"V.C.2"},null,{"$f":"+E279+1","v":45},{"$f":"+F93","v":"Property Management Experience (Also Appendix 45)"},null,null,null,{"$f":"+E93","v":22}]
["The materials required for this Appendix are described above in the Threshold Requirements section."]
[]
[null,{"$f":"\"Appendix \"&E285&\": \"&F285&IF(J285=\"\",\".\",\" (see Threshold Requirement \"&J285&\").\")","v":"Appendix 46: Not Applicable to This QAP."},null,null,{"$f":"+E282+1","v":46},"Not Applicable to This QAP"]
[]
[null,{"$f":"\"Appendix \"&E287&\": \"&F287&IF(J287=\"\",\".\",\" (see Threshold Requirement \"&J287&\").\")","v":"Appendix 47: Not Applicable to This QAP."},null,null,{"$f":"+E285+1","v":47},"Not Applicable to This QAP"]
[]
[null,{"$f":"\"Appendix \"&E289&\": \"&F289&IF(J289=\"\",\".\",\" (see Threshold Requirement \"&J289&\").\")","v":"Appendix 48: Not Applicable to This QAP."},null,null,{"$f":"+E287+1","v":48},"Not Applicable to This QAP"]
[]
[null,{"$f":"\"Appendix \"&E291&\": \"&F291&IF(J291=\"\",\".\",\" (see Threshold Requirement \"&J291&\").\")","v":"Appendix 49: Not Applicable to This QAP."},null,null,{"$f":"+E289+1","v":49},"Not Applicable to This QAP"]
[]
[null,{"$f":"\"Appendix \"&E293&\": \"&F293&IF(J293=\"\",\".\",\" (see Threshold Requirement \"&J293&\").\")","v":"Appendix 50: Not Applicable to This QAP."},null,null,{"$f":"+E291+1","v":50},"Not Applicable to This QAP"]
[]
[null,{"$f":"\"Appendix \"&E295&\": \"&F295&IF(J295=\"\",\".\",\" (see Threshold Requirement \"&J295&\").\")","v":"Appendix 51: Not Applicable to This QAP."},null,null,{"$f":"+E293+1","v":51},"Not Applicable to This QAP"]
[]
["Yes",{"$f":"\"Appendix \"&E297&\": \"&F297&IF(J297=\"\",\".\",\" (see Threshold Requirement \"&J297&\").\")","v":"Appendix 52: Other Project Information."},null,null,{"$f":"+E295+1","v":52},"Other Project Information"]
["This Appendix includes all needed information not covered elsewhere.  See the next section of the Checklist."]
[]
["Yes",{"$f":"\"Appendix \"&E300&\": \"&F300&IF(J300=\"\",\".\",\" (see Threshold Requirement \"&J300&\").\")","v":"Appendix 53: Miscellaneous Waivers."},null,null,{"$f":"+E297+1","v":53},"Miscellaneous Waivers"]
["This Appendix includes the following types of waivers not covered elsewhere: (1) Waiver allowing a bond-financed project to exceed the maximum TDC limits; (2) Waivers for historic rehabilitation projects in accordance with QAP V.A.11; (3) Waiver of the ten year placed in service requirement; and (4) Waivers of minimum design standard requirements.  If no waiver is needed, include Appendix 53 indicating Not Applicable."]
[]
["Yes",{"$f":"\"Appendix \"&E303&\": \"&F303&IF(J303=\"\",\".\",\" (see Threshold Requirement \"&J303&\").\")","v":"Appendix LHC-2: CEO Notification Letter Information."},{"$f":"+'QAP Reference'!A67","v":"III.A"},null,"LHC-2","CEO Notification Letter Information"]
["The format is in the worksheet titled 'LHC-2 CEO Notification'."]
[]
["Yes",{"$f":"\"Appendix \"&E306&\": \"&F306&IF(J306=\"\",\".\",\" (see Threshold Requirement \"&J306&\").\")","v":"Appendix LHC-3: Developer Experience Exhibit."},{"$f":"+C90","v":"IV.C.1  "},null,"LHC-3","Developer Experience Exhibit"]
["The format is in the worksheet titled 'LHC-3 Developer Experience'.  This document must be signed."]
[]
["Yes",{"$f":"\"Appendix \"&E309&\": \"&F309&IF(J309=\"\",\".\",\" (see Threshold Requirement \"&J309&\").\")","v":"Appendix LHC-4: Management Experience Exhibit."},{"$f":"+C282","v":"V.C.2"},null,"LHC-4","Management Experience Exhibit"]
["The format is in the worksheet titled 'LHC-3 Management Experience'.  This document must be signed."]
[]
["Yes",{"$f":"\"Appendix \"&E312&\": \"&F312&IF(J312=\"\",\".\",\" (see Threshold Requirement \"&J312&\").\")","v":"Appendix LHC-5: Tenant Selection Plan."},{"$f":"+'QAP Reference'!A84","v":"VI.A"},null,"LHC-5","Tenant Selection Plan"]
["The Tenant Selection Plan is not required until after notification of award."]
[]
["Appendix 52: Additional Information Needed for this Project",null,"QAP References"]
[]
["The information for each item marked 'Yes\" below is needed, in addition to completion of all user entries in this Application, and in addition to the Threshold requirements and Appendices. The 'QAP References' column will contain a cross-reference to the appropriate portion(s) of the QAP. Some of the requested information is because of the characteristics of this particular application.  Include all such information within Appendix 52."]
[]
[{"$f":"IF('Project Description'!H59=\"Yes\",\"Yes\",\"\")","v":""},{"$f":"\"Appendix \"&TEXT(E319,\"0.00\")&\": \"&F319&\".\"","v":"Appendix 52.01: LIHTC Per-Developer Cap."},{"$f":"+'QAP Reference'!A17","v":"II.B"},null,52.01,"LIHTC Per-Developer Cap"]
["(1) Explain whether there are any other projects, applying in this funding round, for the same Developer (or affiliates, as defined in the QAP). (2) Explain whether any such other project(s) has applied for tax credits which are generated from a bond financing.",null,"Glossary (definition of 'Developer')"]
[]
[{"$f":"IF('Project Description'!H177=Controls!A32,\"Yes\",\"\")","v":""},{"$f":"\"Appendix \"&TEXT(E322,\"0.00\")&\": \"&F322&\".\"","v":"Appendix 52.02: QNP / CHDO Pool Application."},null,null,{"$f":"+E319+0.01","v":52.019999999999996},"QNP / CHDO Pool Application"]
[{"$f":"IF(A322=\"Yes\",\"Please provide evidence that the Qualified Non-Profit or CHDO will receive at least fifty-one percent (51%) of the total Developer's Fee category.\",\"\")","v":""}]
[]
[{"$f":"IF('Project Description'!H183>0,\"Yes\",\"\")","v":""},{"$f":"\"Appendix \"&TEXT(E325,\"0.00\")&\": \"&F325&\".\"","v":"Appendix 52.03: National Housing Trust Fund."},{"$f":"+'QAP Reference'!A14","v":"NA"},null,{"$f":"+E322+0.01","v":52.029999999999994},"National Housing Trust Fund"]
[{"$f":"IF(A325=\"Yes\",F326,\"\")","v":""},null,null,null,null,"You have applied for NHTF funding. Note that Environmental Review will be required.  Also: (1) Please provide documentation that you have set aside at least 10% of units for households at or below 30% AMI.  (2) Please explain how the applicant will absorb any outstanding soft costs in the event NHTF funding is not available."]
[]
[{"$f":"IF('Project Description'!H189>0,\"Yes\",\"\")","v":""},{"$f":"\"Appendix \"&TEXT(E328,\"0.00\")&\": \"&F328&\".\"","v":"Appendix 52.04: HOME Funds."},{"$f":"+'QAP Reference'!A15","v":"Appendix C.N."},null,{"$f":"+E325+0.01","v":52.039999999999992},"HOME Funds"]
[{"$f":"IF(A328=\"Yes\",F329,\"\")","v":""},null,null,null,null,"You have applied for HOME Investment Partnership Funds (HOME). Note that Environmental Review will be required. Also: (1) Note that the project must meet all applicable HOME program eligibility requirements.  (2) Please document the project's compliance with HOME requirements regarding the minimum number of Low HOME and High HOME units.  (3) Please explain how the applicant will absorb any outstanding soft costs in the event HOME funding is not available."]
[]
[{"$f":"IF('Project Description'!H195>0,\"Yes\",\"\")","v":""},{"$f":"\"Appendix \"&TEXT(E331,\"0.00\")&\": \"&F331&\".\"","v":"Appendix 52.05: CDBG-DR Funds."},{"$f":"+'QAP Reference'!A16","v":"Appendix C.N."},null,{"$f":"+E328+0.01","v":52.04999999999999},"CDBG-DR Funds"]
[{"$f":"IF(A331=\"Yes\",F332,\"\")","v":""},null,null,null,null,"You have applied for CDBG-DR funding. Note that Environmental Review will be required.  Also: (1) Please note that the project must meet all applicable CDBG-DR program eligibility requirements.  (2) Please explain how the applicant will absorb any outstanding soft costs in the event CDBG-DR funding is not available.   (3) The funding commitment for any first mortgage loan must acknowledge that the lien of the first mortgage loan will be subject to the 35 year use and affordability agreement.  (4) No payments can be made from the operating account other than operating expenses, the required replacement reserve deposit, and any debt service on a first mortgage loan acceptable to LHC; items that may not be paid from the operating account include asset management fees, investor service fees, deferred developer fee, any other development costs, and any tax credit adjusters; these costs may be paid from development sources such as LIHTC equity installments but may not be paid from the operating account.  (5) If you propose an interest rate other than zero, please submit an analysis showing that (at your proposed interest rate) the likely remaining balance of the loan (including accrued and unpaid interest) will be no more than 80% of the likely residual value of the project at the end of the 35 year loan term."]
[]
[{"$f":"IF('Project Description'!H118=\"Yes\",\"Yes\",\"\")","v":""},{"$f":"\"Appendix \"&TEXT(E334,\"0.00\")&\": \"&F334&\".\"","v":"Appendix 52.06: Multiple Building Types Within the Project."},null,null,{"$f":"+E331+0.01","v":52.059999999999988},"Multiple Building Types Within the Project"]
[{"$f":"IF(A334=\"Yes\",\"In addition to the primary building type (\"&F335&\"), you have indicated that the project includes additional building types. Please include a brief explanation.\",\"\")","v":""},null,null,null,null,{"$f":"+'Project Description'!H117","v":"Missing"}]
[]
[{"$f":"IF('Project Description'!H121=\"Yes\",\"Yes\",\"\")","v":""},{"$f":"\"Appendix \"&TEXT(E337,\"0.00\")&\": \"&F337&\".\"","v":"Appendix 52.07: Multiple Census Tracts Within the Project."},null,null,{"$f":"+E334+0.01","v":52.069999999999986},"Multiple Census Tracts Within the Project",null,null,null,null,null,{"$f":"+'Project Description'!H120","v":"Missing"}]
[{"$f":"IF(A337=\"Yes\",\"In addition to the primary census tract (census tract \"&L337&\"), you have indicated that the project includes additional census tracts. \"&F338,\"\")","v":""},null,null,null,null,"(1) Please include an explanation including one or more maps showing the census tracts in which the project is located. (2) Specify the number of total units, and the number of Low Income Units, located in each census tract."]
[]
[{"$f":"IF('Project Description'!H152=\"Yes\",\"Yes\",\"\")","v":""},{"$f":"\"Appendix \"&TEXT(E340,\"0.00\")&\": \"&F340&\".\"","v":"Appendix 52.08: Homeownership Project."},"Glossary",null,{"$f":"+E337+0.01","v":52.079999999999984},"Homeownership Project"]
[{"$f":"IF(A340=\"Yes\",F341,\"\")","v":""},null,null,null,null,"You have indicated that this is a Homeownership Project as defined in the QAP. (1) Please document your commitment to sell units at Minimum Purchase Price not later than the 16th year of the Compliance Period. (2) Please describe your proposed transactional structure, which must be acceptable to the LHC according to industry best practices that protect the expectations of tenants. "]
[]
[{"$f":"IF('Project Description'!M218=\"Boost\",\"Yes\",\"\")","v":""},{"$f":"\"Appendix \"&TEXT(E343,\"0.00\")&\": \"&F343&\".\"","v":"Appendix 52.09: Basis Boost."},{"$f":"+'QAP Reference'!A19","v":"II.C"},null,{"$f":"+E340+0.01","v":52.089999999999982},"Basis Boost"]
[{"$f":"IF(A343=\"Yes\",F344,\"\")","v":""},null,null,null,null,"You are applying for a Basis Boost. Please document that the project is eligible for the Basis Boost that you have proposed."]
[]
[{"$f":"IF('Project Description'!H539=\"Yes\",\"Yes\",\"\")","v":""},{"$f":"\"Appendix \"&TEXT(E346,\"0.00\")&\": \"&F346&\".\"","v":"Appendix 52.10: Equipment Owned by the Developer or Builder or a Related Party."},{"$f":"+'QAP Reference'!A78","v":"IV.D"},null,{"$f":"+E343+0.01","v":52.09999999999998},"Equipment Owned by the Developer or Builder or a Related Party"]
[{"$f":"IF(A346=\"Yes\",F347,\"\")","v":""},null,null,null,null,"You have indicated that the project will use equipment that is owned by the Developer, the Builder, or a Related Party. Explain your proposal to utilize this equipment in the development of the project, in accordance with QAP Section V.D.5. Provide a discussion explaining at least the following: identify the equipment, explain who owns it, explain why the equipment is needed for the project, explain why you think it is appropriate for the project to utilize this equipment rather than lease it from a third party, and explain the proposed rental charges and why you think they are reasonable.  "]
[]
[{"$f":"IF(AND('Project Description'!H585=\"Yes\",'Project Description'!H587>0),\"Yes\",\"\")","v":""},{"$f":"\"Appendix \"&TEXT(E349,\"0.00\")&\": \"&F349&\".\"","v":"Appendix 52.11: Community Service Facility."},"Glossary",null,{"$f":"+E346+0.01","v":52.109999999999978},"Community Service Facility"]
[{"$f":"IF(A349=\"Yes\",F350,\"\")","v":""},null,null,null,null,"Please explain your proposal to include a Community Service Facility in the project:  (1) Describe the facility. (2) Explain whether any fees will be charged.  (3) Provide an opinion of counsel that the facility you intend to build will, when completed, meet all applicable IRS requirements to be treated as a community service facility. (4) Provide an opinion of counsel stating the extent to which the cost of the Community Service Facility can be included in the eligible basis of the project. "]
[]
["Yes",{"$f":"\"Appendix \"&TEXT(E352,\"0.00\")&\": \"&F352&\".\"","v":"Appendix 52.12: Applicant's Concluded Utility Allowances."},null,null,{"$f":"+E349+0.01","v":52.119999999999976},"Applicant's Concluded Utility Allowances"]
["Explain how you derived the utility allowances for LIHTC units. Attach appropriate documentation, including the date you made the calculations. "]
[]
[{"$f":"IF('Unit Mix and Rents'!AM43=0,\"\",\"Yes\")","v":""},{"$f":"\"Appendix \"&TEXT(E355,\"0.00\")&\": \"&F355&\".\"","v":"Appendix 52.13: Flags on Unit Mix and Rents Worksheet."},null,null,{"$f":"+E352+0.01","v":52.129999999999974},"Flags on Unit Mix and Rents Worksheet"]
[{"$f":"IF(A355=\"Yes\",F356,\"\")","v":""},null,null,null,null,"One or more \"Notes\" appeared on the Unit Mix and Rents worksheet, indicating potential problems with proposed rents, unit size, number of bathrooms, and/or qualifying as PSH Units. Please provide a response explaining each Note / flag."]
[]
[{"$f":"IF('Project Description'!H815=\"Yes\",\"Yes\",\"\")","v":""},{"$f":"\"Appendix \"&TEXT(E358,\"0.00\")&\": \"&F358&\".\"","v":"Appendix 52.14: Points Claimed for Elderly Households."},{"$f":"+'QAP Reference'!A93","v":"Appendix A.II.A.ii"},null,{"$f":"+E355+0.01","v":52.139999999999972},"Points Claimed for Elderly Households"]
[{"$f":"IF(A358=\"Yes\",F359,\"\")","v":""},null,null,null,null,"Please provide (a) Description of Supportive Services tailored to each Elderly Household (see the Supportive Services definitions in the Glossary); (b) Cost per annum of Supportive Services per Elderly Household or written commitment from governmental or non-profit agency that Supportive Services will be provided to Project without cost; (c) Experience of Taxpayer/Owner in developing Projects servicing Elderly Households; and (d) documentation of your commitment to set aside 100% of total units for Elderly Households."]
[]
[{"$f":"IF('Selection Criteria'!H48=0,\"\",\"Yes\")","v":""},{"$f":"\"Appendix \"&TEXT(E361,\"0.00\")&\": \"&F361&\".\"","v":"Appendix 52.15: Points Claimed for Non-PSH Units Affordable At or Below 30% AMI - N/A in 2025 QAP."},{"$f":"+'QAP Reference'!A96","v":"Appendix A.III.B(i)(a)"},null,{"$f":"+E358+0.01","v":52.14999999999997},"Points Claimed for Non-PSH Units Affordable At or Below 30% AMI - N/A in 2025 QAP"]
[{"$f":"IF(A361=\"Yes\",F362,\"\")","v":""},null,null,null,null,"Please evidence ability to maintain 30% AMI units via rental income, grants or subsidies throughout the projects affordability period."]
[]
[{"$f":"IF('Selection Criteria'!H49=0,\"\",\"Yes\")","v":""},{"$f":"\"Appendix \"&TEXT(E364,\"0.00\")&\": \"&F364&\".\"","v":"Appendix 52.16: Points Claimed for PSH Units - N/A in 2025 QAP."},{"$f":"+'QAP Reference'!A97","v":"Appendix A.III.B(i)(b)"},null,{"$f":"+E361+0.01","v":52.159999999999968},"Points Claimed for PSH Units - N/A in 2025 QAP"]
[{"$f":"IF(A364=\"Yes\",F365,\"\")","v":""},null,null,null,null,"Please submit letter of PSH Support from the Executive Director of the Louisiana Housing Authority. The letter of support must be requested no later than 14 days prior to the application due date."]
[]
[{"$f":"IF('Unit Mix and Rents'!I41=0,\"\",\"Yes\")","v":""},{"$f":"\"Appendix \"&TEXT(E367,\"0.00\")&\": \"&F367&\".\"","v":"Appendix 52.17: Rental Subsidy."},null,null,{"$f":"+E364+0.01","v":52.169999999999966},"Rental Subsidy"]
[{"$f":"IF(A367=\"Yes\",F368,\"\")","v":""},null,null,null,null,"The Unit Mix and Rents worksheet indicates that some units have Rental Subsidy. Please provide an explanation, including at least: identify the rental subsidy program, indicate whether subsidy is project-based or tenant-based, the number of units covered (by unit type), the duration of the rental subsidy contract, when the next rent adjustment will occur, an explanation for the type of annual rent adjustment, a copy of the rental subsidy contract, and contact information for the agency providing the rental subsidy."]
[]
[{"$f":"IF('Selection Criteria'!D66=0,\"\",\"Yes\")","v":""},{"$f":"\"Appendix \"&TEXT(E370,\"0.00\")&\": \"&F370&\".\"","v":"Appendix 52.18: Points Claimed for Optional Amenities."},{"$f":"+'QAP Reference'!A101","v":"Appendix A.V.B"},null,{"$f":"+E367+0.01","v":52.179999999999964},"Points Claimed for Optional Amenities"]
[{"$f":"IF(A370=\"Yes\",F371,\"\")","v":""},null,null,null,null,"Please submit documentation that the project qualifies for the Optional Amenities claimed in Selection Criterion V.C. in accordance with the definitions in the Glossary. "]
[]
[{"$f":"IF('Project Description'!E412=0,\"\",\"Yes\")","v":""},{"$f":"\"Appendix \"&TEXT(E373,\"0.00\")&\": \"&F373&\".\"","v":"Appendix 52.19: Deferred Developer Fee Payable Within 15 Years."},null,null,{"$f":"+E370+0.01","v":52.189999999999962},"Deferred Developer Fee Payable Within 15 Years"]
[{"$f":"IF(A373=\"Yes\",F374,\"\")","v":""},null,null,null,null,"Please submit (in Excel format) your 15 year cash flow pro forma, consistent with the cash flow waterfall for your proposed project, showing how much of the deferred developer fee is reasonably likely to be repaid in 15 years."]
[]
[{"$f":"IF('Project Description'!E399=0,\"\",\"Yes\")","v":""},{"$f":"\"Appendix \"&TEXT(E376,\"0.00\")&\": \"&F376&\".\"","v":"Appendix 52.20: CDBG Interest Rate Above Zero."},null,null,{"$f":"+E373+0.01","v":52.19999999999996},"CDBG Interest Rate Above Zero"]
[{"$f":"IF(A376=\"Yes\",F377,\"\")","v":""},null,null,null,null,"You have selected a non-zero interest rate for your proposed CDBG Gap Financing Loan. A non-zero interest rate is allowed only when (1) the applicant concludes that, at the end of the 35 year loan term, the outstanding balance (taking into account interest accrual plus payments from Surplus Cash) will be no greater than 80% of projected residual value and (2) the State's Office of Community Development agrees, in its sole and absolute discretion. Please provide your 35 year cash flow projection and your projection of residual value at the end of year 35."]
[{"$f":"IF('Development Costs'!F255>1,\"Yes\",\"\")","v":{"$error":"#N/A"}},{"$f":"\"Appendix \"&TEXT(E378,\"0.00\")&\": \"&F378&\".\"","v":"Appendix 52.21: Adjusted Total Development Cost is Above the HUD Limit."},null,null,{"$f":"+E376+0.01","v":52.209999999999958},"Adjusted Total Development Cost is Above the HUD Limit"]
[{"$f":"IF(A378<>\"Yes\",\"\",\"Section \"&T379&\" indicates that adjusted TDC is \"&TEXT(U379,\"0.0%\")&\" of the HUD TDC Limit.\")","v":{"$error":"#N/A"}},null,null,null,null,"If the project is an SRO project, or a Project Reallocated Credits Based on Housing Discrimination (as defined in the QAP), the HUD limit may be exceeded if you provide the documentation required by the QAP and LHC agrees. Otherwise, generally you will have to reduce project costs so that the HUD limit is not exceeded.",null,null,null,null,null,null,null,null,null,null,null,null,null,{"$f":"+'Development Costs'!I231","v":40},{"$f":"+'Development Costs'!F255","v":{"$error":"#N/A"}}]
[]
[{"$f":"IF('Project Description'!H641=0,\"\",\"Yes\")","v":""},{"$f":"\"Appendix \"&TEXT(E381,\"0.00\")&\": \"&F381&\".\"","v":"Appendix 52.22: Project has a Commercial Component; see Section 20.14."},null,null,{"$f":"+E378+0.01","v":52.219999999999956},{"$f":"\"Project has a Commercial Component; see Section \"&T381","v":"Project has a Commercial Component; see Section 20.14"},null,null,null,null,null,null,null,null,null,null,null,null,null,{"$f":"+'Project Description'!A621","v":20.140000000000022}]
[{"$f":"IF(A381=\"Yes\",F382,\"\")","v":""},null,null,null,null,"You indicated that the project has a commercial component.  All costs of the project (including soft costs) need to be allocated between the commercial and non-commercial components.  The total costs (including allocated soft costs) for the commercial component cannot be included in basis. Please explain the commercial component of the project, provide the required allocation of costs, and provide any other information necessary for LHC to accurately understand the commercial component of the project."]
[{"$f":"IF('Project Description'!H701=\"Yes\",\"Yes\",\"\")","v":"Yes"},{"$f":"\"Appendix \"&TEXT(E383,\"0.00\")&\": \"&F383&\".\"","v":"Appendix 52.23: National Non-Metropolitan AMI; see Section 23.01."},null,null,{"$f":"+E381+0.01","v":52.229999999999954},{"$f":"\"National Non-Metropolitan AMI; see Section \"&T383","v":"National Non-Metropolitan AMI; see Section 23.01"},null,null,null,null,null,null,null,null,null,null,null,null,null,{"$f":"+'Project Description'!A699","v":23.01}]
[{"$f":"IF(A383=\"Yes\",F384,\"\")","v":"You indicated that the project will utilize the national non-metropolitan area median income. Please provide: (1) documentation that the project is located in a rural area as defined by the Department of Agriculture (you will need to use the Department of Agriculture's website eligibility tool, and you will need to provide a screen shot showing that your project's location is 'rural'); and (2) documentation of the national non-metropolitan area median income that you propose to utilize."},null,null,null,null,"You indicated that the project will utilize the national non-metropolitan area median income. Please provide: (1) documentation that the project is located in a rural area as defined by the Department of Agriculture (you will need to use the Department of Agriculture's website eligibility tool, and you will need to provide a screen shot showing that your project's location is 'rural'); and (2) documentation of the national non-metropolitan area median income that you propose to utilize."]
[]
[{"$f":"IF('Project Description'!H606=\"Yes\",\"Yes\",\"\")","v":""},{"$f":"\"Appendix \"&TEXT(E386,\"0.00\")&\": \"&F386&\".\"","v":"Appendix 52.24: Cash Flow Note for Acquisition of Existing Project."},null,null,{"$f":"+E383+0.01","v":52.239999999999952},"Cash Flow Note for Acquisition of Existing Project"]
[{"$f":"IF(A386=\"Yes\",F387,\"\")","v":""},null,null,null,null,{"$f":"\"You indicated that the financing plan includes a cash flow note, for the acquisition of an existing project. Please provide the documentation required by Section \"&T387&\" of the QAP.\"","v":"You indicated that the financing plan includes a cash flow note, for the acquisition of an existing project. Please provide the documentation required by Section IV.D.4 of the QAP."},null,null,null,null,null,null,null,null,null,null,null,null,null,{"$f":"+'QAP Reference'!A30","v":"IV.D.4"}]
[]
[{"$f":"IF('Project Description'!H610=\"Yes\",\"Yes\",\"\")","v":""},{"$f":"\"Appendix \"&TEXT(E389,\"0.00\")&\": \"&F389&\".\"","v":"Appendix 52.25: Allowed Return on Taxpayer Capital."},{"$f":"+'QAP Reference'!A29","v":"IV.D.3"},null,{"$f":"+E386+0.01","v":52.24999999999995},"Allowed Return on Taxpayer Capital"]
[{"$f":"IF(A389=\"Yes\",F390,\"\")","v":""},null,null,null,null,{"$f":"\"You indicated that the project includes Soft Funds and that you intend to claim a Return on Taxpayer Capital. Please provide the documentation required by Section \"&T390&\" of the QAP.\"","v":"You indicated that the project includes Soft Funds and that you intend to claim a Return on Taxpayer Capital. Please provide the documentation required by Section IV.D.3 of the QAP."},null,null,null,null,null,null,null,null,null,null,null,null,null,{"$f":"+'QAP Reference'!A29","v":"IV.D.3"}]
[]
[{"$f":"IF('Project Description'!M633='Project Description'!Q635,\"Yes\",\"\")","v":""},{"$f":"\"Appendix \"&TEXT(E392,\"0.00\")&\": \"&F392&\".\"","v":"Appendix 52.26: Income Averaging Set-Aside Was Selected."},null,null,{"$f":"+E389+0.01","v":52.259999999999948},"Income Averaging Set-Aside Was Selected"]
[{"$f":"IF(A392=\"Yes\",F393,\"\")","v":""},null,null,null,null,"You selected the 'Income Averaging' set-aside, pursuant to Section 42(g)(1)(C) of the Internal Revenue Code. Please provide a discussion explaining why you believe the proposed project meets all applicable requirements for this set-aside."]
[]
[{"$f":"IF('Project Description'!H574=0,\"\",\"Yes\")","v":""},{"$f":"\"Appendix \"&TEXT(E395,\"0.00\")&\": \"&F395&\".\"","v":"Appendix 52.27: Documentation of Extraordinary Site Costs."},{"$f":"+'QAP Reference'!A70","v":"IV.D"},null,{"$f":"+E392+0.01","v":52.269999999999946},"Documentation of Extraordinary Site Costs"]
[{"$f":"IF(A395=\"Yes\",F396,\"\")","v":""},null,null,null,null,"Explain your proposal to exclude Extraordinary Site Costs from the Cost Limits calculation, in accordance with the QAP.  Include (1) the recommendation of the project's Architect / Engineer; (2) your cost estimate based on industry standard cost indexes; (3) why you believe these costs constitute Extraordinary Site Costs in accordance with the QAP; and (4) a waiver request.  The following is from the QAP FAQs: \"Extraordinary Site Costs are costs that are separate from the ordinary construction costs. These costs must be distinctive from the TDC.  A waiver for exceeding TDC for extraordinary site costs must be submitted with the application, along with evidence providing a justification as to why the additional costs qualify as Extraordinary Site Costs. Such costs will be reviewed by LHC in accordance with industry standard cost indexes.\""]
[]
[{"$f":"IF(AND('Project Description'!H595=\"Yes\",'Project Description'!H597>0),\"Yes\",\"\")","v":""},{"$f":"\"Appendix \"&TEXT(E398,\"0.00\")&\": \"&F398&\".\"","v":"Appendix 52.28: Documentation of Request that LHC Staff Approve Exclusion of Other Cost Increases."},{"$f":"+'QAP Reference'!A73","v":"IV.D"},null,{"$f":"+E395+0.01","v":52.279999999999944},"Documentation of Request that LHC Staff Approve Exclusion of Other Cost Increases"]
[{"$f":"IF(A398=\"Yes\",F399,\"\")","v":""},null,null,null,null,"Explain your proposal that LHC staff approve the exclusion of excess costs that are not Extraordinary Site Costs, Community Facilities costs, or Community Service Facilities costs. Include (1) a detailed explanation of the costs including an explanation for how you estimated the costs; (2) your acknowledgment that LHC will determine the project not to be feasible or viable if LHC staff deny your request; (3) your acknowledgment that these costs will not be factored into the calculation of the developer fee base; (4) the extent (if any) to which the costs are necessary to the production of affordable housing; (5) to what extent (if any) these costs are required because of a local municipality requirement; (6) to what extent (if any) local funding has been committed to the project to offset these costs; and (7) any other information that you believe LHC staff will need in order to make a decision. "]
[]
[{"$f":"IF('Development Costs'!B256=\"\",\"\",\"Yes\")","v":{"$error":"#N/A"}},{"$f":"\"Appendix \"&TEXT(E401,\"0.00\")&\": \"&F401&\".\"","v":"Appendix 52.29: Adjusted TDC Exceeds Maximum TDC Limit for This Project."},{"$f":"IF(S401=\"SRO\",'QAP Reference'!A72,'QAP Reference'!A73)","v":"IV.D"},null,{"$f":"+E398+0.01","v":52.289999999999942},{"$f":"\"Adjusted TDC Exceeds Maximum TDC Limit for \"&S401&\" Project\"","v":"Adjusted TDC Exceeds Maximum TDC Limit for This Project"},null,null,null,null,null,null,null,null,null,null,null,null,{"$f":"IF('Project Description'!H161=\"Yes\",\"SRO\",IF('Project Description'!H162=\"Yes\",\"Anti-Discrimination\",\"This\"))","v":"This"}]
[{"$f":"IF(A401=\"\",\"\",IF(A37=\"Yes\",IF(S401=\"SRO\",F402,F403)))","v":{"$error":"#N/A"}},null,null,null,null,{"$f":"\"This is an SRO project, with development costs that exceed the QAP's Maximum TDC Limit. Please provide the documentation required in QAP Section \"&'QAP Reference'!A72&\".\"","v":"This is an SRO project, with development costs that exceed the QAP's Maximum TDC Limit. Please provide the documentation required in QAP Section IV.D."}]
[null,null,null,null,null,{"$f":"\"This is an anti-discrimination project, with development costs that exceed the QAP's Maximum TDC Limit. Please provide the documentation required in QAP Section \"&'QAP Reference'!A73&\".\"","v":"This is an anti-discrimination project, with development costs that exceed the QAP's Maximum TDC Limit. Please provide the documentation required in QAP Section IV.D."}]
[]
[{"$f":"IF('Revenues and Expenses'!C83<'Revenues and Expenses'!C85,\"Yes\",\"\")","v":""},{"$f":"\"Appendix \"&TEXT(E405,\"0.00\")&\": \"&F405&\".\"","v":"Appendix 52.30: Waiver of QAP Minimum Operating Expense Requirement."},{"$f":"+'QAP Reference'!A33","v":"IV.D.9"},null,{"$f":"+E401+0.01","v":52.29999999999994},"Waiver of QAP Minimum Operating Expense Requirement"]
[{"$f":"IF(A405=\"Yes\",F406,\"\")","v":""},null,null,null,null,{"$f":"\"You have proposed total operating expenses that are below the minimum level specified in Section \"&C405&\" of the QAP.  Provide a request to waive this requirement of the QAP.  LHC suggests that you support this request by demonstrating that your proposed expenses are reasonable in relation to the actual operating expenses of comparable projects.\"","v":"You have proposed total operating expenses that are below the minimum level specified in Section IV.D.9 of the QAP.  Provide a request to waive this requirement of the QAP.  LHC suggests that you support this request by demonstrating that your proposed expenses are reasonable in relation to the actual operating expenses of comparable projects."}]
[]
[{"$f":"IF(SUM('Revenues and Expenses'!C17:C19)=0,\"\",\"Yes\")","v":""},{"$f":"\"Appendix \"&TEXT(E408,\"0.00\")&\": \"&F408&\".\"","v":"Appendix 52.31: Operating Subsidy."},null,null,{"$f":"+E405+0.01","v":52.309999999999938},"Operating Subsidy"]
[{"$f":"IF(A408=\"Yes\",F409,\"\")","v":""},null,null,null,null,"The project's estimated revenues include operating subsidy.  Please provide additional information including: (1) The type of operating subsidy (for example, public housing Operating Fund); (2) For what period of time is the operating subsidy committed?; (3) If the operating subsidy commitment is less than 35 years, what is likely to happen at the end of the commitment period?; (4) What do the operating subsidy legal documents say about how the amount of operating subsidy will change, year by year?; (5) Is it reasonable to expect the amount of operating subsidy to grow at roughly the same rate as total operating expenses?; and (6) A copy of each operating subsidy contract or similar legal document."]
[]
[{"$f":"IF('Project Description'!H103=\"Yes\",\"Yes\",\"\")","v":""},{"$f":"\"Appendix \"&TEXT(E411,\"0.00\")&\": \"&F411&\".\"","v":"Appendix 52.32: Rehab."},{"$f":"+'QAP Reference'!A50","v":"IV.A.14"},null,{"$f":"+E408+0.01","v":52.319999999999936},"Rehab"]
[{"$f":"IF(A411=\"Yes\",F412,\"\")","v":""},null,null,null,null,"You indicated that rehab will take place.  Please provide a discussion of the scope of rehab.  Indicate the fraction of each significant building component that is being replaced in rehab; for example, 100% of refrigerators, 100% of roofs, 50% of kitchen cabinets, …)."]
[]
[{"$f":"IF('Project Description'!H886=\"Yes\",\"Yes\",\"\")","v":""},{"$f":"\"Appendix \"&TEXT(E414,\"0.00\")&\": \"&F414&\".\"","v":"Appendix 52.33: Points Claimed for HUD Defensible Space."},{"$f":"+'QAP Reference'!A106","v":"Appendix A.V.F"},null,{"$f":"+E411+0.01","v":52.329999999999934},"Points Claimed for HUD Defensible Space"]
[{"$f":"IF(A414=\"Yes\",F415,\"\")","v":""},null,null,null,null,"You indicated that the project includes HUD Defensible Space, as defined in the QAP.  Please demonstrate that the project meets all applicable requirements of the QAP regarding Defensible Space."]
[]
[{"$f":"IF('Project Description'!H936=\"Yes\",\"Yes\",\"\")","v":""},{"$f":"\" \"&TEXT(E417,\"0.00\")&\": \"&F417&\".\"","v":" 27.11: Points Claimed for Material Participation of a Minority."},null,null,27.11,"Points Claimed for Material Participation of a Minority"]
[{"$f":"IF(A417=\"Yes\",F418,\"\")","v":""},null,null,null,null,"You indicated that the project includes the Material Participation of a Minority, as defined in the QAP.  Please demonstrate that the project meets all applicable requirements of the QAP regarding Material Participation of a Minority."]
[]
[{"$f":"IF('Project Description'!H940=\"Yes\",\"Yes\",\"\")","v":""},{"$f":"\" \"&TEXT(E420,\"0.00\")&\": \"&F420&\".\"","v":" 27.12: Points Claimed for Minority Joint Ventures."},null,null,27.12,"Points Claimed for Minority Joint Ventures"]
[{"$f":"IF(A420=\"Yes\",F421,\"\")","v":""},null,null,null,null,"You indicated that the project includes Minority Joint Ventures, as defined in the QAP.  Please demonstrate that the project meets all applicable requirements of the QAP regarding Minority Joint Ventures."]
[]
[{"$f":"IF('Project Description'!H932=\"Yes\",\"Yes\",\"\")","v":""},{"$f":"\" \"&TEXT(E423,\"0.00\")&\": \"&F423&\".\"","v":" 27.10: Threshold Requirement: Eviction Prevention and Low Barrier Tenant Selection."},{"$f":"+'QAP Reference'!A57","v":"IV.A.20"},null,27.1,"Threshold Requirement: Eviction Prevention and Low Barrier Tenant Selection"]
[{"$f":"IF(A423=\"Yes\",F424,\"\")","v":""},null,null,null,null,"You indicated that the project includes Eviction Prevention and Low Barrier Tenant Selection, as defined in the QAP.  Please demonstrate that the project meets all applicable requirements of the QAP regarding  Eviction Prevention and Low Barrier Tenant Selection."]
[]
[]
[]
[]
[]
[]
[]
[]
[]
["ITEMS TO FIGURE OUT LATER",null,"QAP References"]
[]
[{"$f":"IF('Project Description'!H204=0,\"\",\"Yes\")","v":""},"Signed and Notarized Syndication Information and Certification.  See the Syndication worksheet contained in this Application."]
[]
[]
["Yes","Taxpayer Certification.  Provide the worksheet included in this Application titled 'Taxpayer Certification', signed and  notarized."]
[]
[]
[]
[null,"Financing Certification?"]
[]
[null,"Required Fees?"]

{"sheet":"Serious Problems","index":16,"n_rows":74,"n_cols":12,"rows_kept":74,"cut":false,"hidden":false,"merged":[]}
[]
[]
[{"$f":"+Instructions!A3","v":"2025 QAP Underwriting Application v1.1"}]
[{"$f":"TRIM('Project Description'!E84)&\" (\"&TRIM('Project Description'!E86)&\" LA), \"&'Project Description'!E50","v":" ( LA), "}]
[]
["Summary of 'Serious Problem' Flags"]
[]
["Worksheet","Row","'Serious Problem' Message"]
[]
["Project Description",{"$f":"IF(L10<>0,\"Multi\",\"\")","v":"Multi"},{"$f":"IF(E10=0,\"\",E10)","v":"Error--There are 207 areas that contain 'MISSING', please review and enter a value."},null,{"$f":"IF(B10=\"Multi\",\"Error--There are \" &COUNTIF('Project Description'!A1:J2036,\"Missing\")& \" areas that contain 'MISSING', please review and enter a value.\",\"\")","v":"Error--There are 207 areas that contain 'MISSING', please review and enter a value."},null,null,null,null,null,null,{"$f":"COUNTIF('Project Description'!A1:J2036,\"Missing\")","v":207}]
["Project Description",{"$f":"ROW('Project Description'!B24)","v":24},{"$f":"IF(E11=0,\"\",E11)","v":""},null,{"$f":"'Project Description'!B24","v":""}]
["Project Description",{"$f":"ROW('Project Description'!B13)","v":13},"",null,{"$f":"'Project Description'!B13","v":""}]
["Project Description",115,{"$f":"IF(E13=0,\"\",E13)","v":""},null,{"$f":"IF('Project Description'!H120=\"x\",\"Error--REQUIRED: Census Tract information\",IF('Project Description'!H120=\"\",\"Error--the QAP the QAP requires Census Tract information\",\"\"))","v":""}]
["Project Description",118,{"$f":"IF(E14=0,\"\",E14)","v":""},null,{"$f":"IF('Project Description'!H123=0,\"Error--REQUIRED: Median Income for Primary Census Tract\",IF('Project Description'!H123=\"\",\"Error--the QAP requires Median Income for Primary Census Tract\",\"\"))","v":""}]
["Project Description",148,{"$f":"IF(E15=0,\"\",E15)","v":""}]
["Project Description",{"$f":"ROW('Project Description'!B155)","v":155},"",null,{"$f":"'Project Description'!B155","v":""}]
["Project Description",{"$f":"ROW('Project Description'!B184)","v":184},"",null,{"$f":"'Project Description'!B184","v":""}]
[{"$f":"+A17","v":"Project Description"},{"$f":"ROW('Project Description'!B190)","v":190},"",null,{"$f":"'Project Description'!B190","v":""}]
["Project Description",{"$f":"ROW('Project Description'!B196)","v":196},"",null,{"$f":"'Project Description'!B196","v":""}]
["Project Description",{"$f":"ROW('Project Description'!B205)","v":205},"",null,{"$f":"'Project Description'!B205","v":""}]
["Project Description",{"$f":"ROW('Project Description'!B219)","v":219},"",null,{"$f":"'Project Description'!B222","v":""}]
["Project Description",{"$f":"ROW('Project Description'!B433)","v":433},{"$f":"IF(E22=0,\"\",E22)","v":"     "},null,{"$f":"'Project Description'!B433","v":"     "}]
[{"$f":"+A21","v":"Project Description"},{"$f":"ROW('Project Description'!B635)","v":635},"",null,{"$f":"+'Project Description'!B635","v":""}]
[{"$f":"+A22","v":"Project Description"},{"$f":"ROW('Project Description'!A693)","v":693},"",null,{"$f":"+'Project Description'!B693","v":""}]
["Project Description",{"$f":"ROW('Project Description'!A703)","v":703},"",null,{"$f":"+'Project Description'!B703","v":""}]
[{"$f":"+A24","v":"Project Description"},{"$f":"ROW('Project Description'!B821)","v":821},"",null,{"$f":"'Project Description'!B821","v":""}]
[{"$f":"+A25","v":"Project Description"},{"$f":"ROW('Project Description'!B873)","v":873},"",null,{"$f":"'Project Description'!B873","v":""}]
[{"$f":"+A26","v":"Project Description"},{"$f":"ROW('Project Description'!B911)","v":911},"",null,{"$f":"'Project Description'!B911","v":""}]
["Project Description",{"$f":"ROW('Project Description'!B914)","v":914},"",null,{"$f":"'Project Description'!B914","v":""}]
["Project Description",{"$f":"ROW('Project Description'!B958)","v":958},"",null,{"$f":"'Project Description'!B958","v":""}]
["Project Description",{"$f":"ROW('Project Description'!B960)","v":960},"",null,{"$f":"'Project Description'!B960","v":""}]
["Project Description",{"$f":"ROW('Project Description'!B962)","v":962},"",null,{"$f":"'Project Description'!B962","v":""}]
["Project Description",{"$f":"ROW('Project Description'!B964)","v":964},"",null,{"$f":"'Project Description'!B964","v":""}]
["Project Description",{"$f":"ROW('Project Description'!B968)","v":968},"",null,{"$f":"'Project Description'!B968","v":""}]
["Project Description",{"$f":"ROW('Project Description'!B986)","v":986},"",null,{"$f":"'Project Description'!B986","v":""}]
["Project Description",{"$f":"ROW('Project Description'!B1015)","v":1015},"",null,{"$f":"'Project Description'!C1015","v":""}]
[{"$f":"+A36","v":"Project Description"},{"$f":"ROW('Project Description'!A1025)","v":1025},"",null,{"$f":"'Project Description'!B1025","v":""}]
["Unit Mix and Rents",{"$f":"ROW('Unit Mix and Rents'!A49)","v":49},"",null,{"$f":"+'Unit Mix and Rents'!O49","v":""}]
["Unit Mix and Rents",{"$f":"ROW('Unit Mix and Rents'!A58)","v":58},"0.0% of units are affordable at or below 30% AMI; QAP requires at least 5%",null,{"$f":"+'Unit Mix and Rents'!B58","v":"0.0% of units are affordable at or below 30% AMI; QAP requires at least 5%"}]
["Development Costs",{"$f":"ROW('Development Costs'!A60)","v":60},"",null,{"$f":"+'Development Costs'!E60","v":""}]
["Development Costs",{"$f":"ROW('Development Costs'!A99)","v":99},"",null,{"$f":"+'Development Costs'!E99","v":""}]
["Development Costs",{"$f":"ROW('Development Costs'!A257)","v":257},{"$error":"#N/A"},null,{"$f":"+'Development Costs'!B257","v":{"$error":"#N/A"}}]
[{"$f":"+A41","v":"Development Costs"},{"$f":"ROW('Development Costs'!A379)","v":379},"",null,{"$f":"+'Development Costs'!B379","v":""}]
[{"$f":"+A43","v":"Development Costs"},{"$f":"ROW('Development Costs'!A380)","v":380},"",null,{"$f":"+'Development Costs'!B380","v":""}]
["Development Costs",{"$f":"ROW('Development Costs'!A381)","v":381},"",null,{"$f":"+'Development Costs'!B381","v":""}]
["Development Costs",{"$f":"ROW('Development Costs'!A382)","v":382},"",null,{"$f":"+'Development Costs'!B382","v":""}]
["Development Costs",{"$f":"ROW('Development Costs'!A383)","v":383},"",null,{"$f":"+'Development Costs'!B383","v":""}]
["Development Costs",{"$f":"ROW('Development Costs'!A384)","v":384},"",null,{"$f":"+'Development Costs'!B384","v":""}]
["Development Costs",{"$f":"ROW('Development Costs'!A385)","v":385},"",null,{"$f":"+'Development Costs'!B385","v":""}]
["Development Costs",{"$f":"ROW('Development Costs'!A153)","v":153},"",null,{"$f":"+'Development Costs'!B153","v":""}]
["Basis Calculation",{"$f":"ROW('Basis Calculation'!A58)","v":58},"",null,{"$f":"+'Basis Calculation'!B58","v":""}]
[{"$f":"+A51","v":"Basis Calculation"},{"$f":"ROW('Basis Calculation'!A59)","v":59},"",null,{"$f":"+'Basis Calculation'!B59","v":""}]
[{"$f":"+A52","v":"Basis Calculation"},{"$f":"ROW('Basis Calculation'!A60)","v":60},"",null,{"$f":"+'Basis Calculation'!B60","v":""}]
[{"$f":"+A53","v":"Basis Calculation"},{"$f":"ROW('Basis Calculation'!A61)","v":61},"",null,{"$f":"+'Basis Calculation'!B61","v":""}]
[{"$f":"+A54","v":"Basis Calculation"},{"$f":"ROW('Basis Calculation'!A62)","v":62},"",null,{"$f":"+'Basis Calculation'!B62","v":""}]
[{"$f":"+A55","v":"Basis Calculation"},{"$f":"ROW('Basis Calculation'!A63)","v":63},"",null,{"$f":"+'Basis Calculation'!B63","v":""}]
["Syndication",{"$f":"ROW(Syndication!A33)","v":33},"",null,{"$f":"+Syndication!D33","v":""}]
[null,null,""]
[null,null,""]
[null,null,""]
[null,null,""]
[null,null,""]
[null,null,""]
[null,null,""]
[null,null,""]
[null,null,""]
[null,null,""]
[null,null,""]
[null,null,""]
[null,null,""]
[null,null,""]
[null,null,""]
[null,null,""]
[null,null,""]

{"sheet":"Reviewer Follow-Ups","index":17,"n_rows":67,"n_cols":7,"rows_kept":67,"cut":false,"hidden":true,"merged":[]}
[]
[]
[{"$f":"+Instructions!A3","v":"2025 QAP Underwriting Application v1.1"}]
[{"$f":"TRIM('Project Description'!E84)&\" (\"&TRIM('Project Description'!E86)&\" LA), \"&'Project Description'!E50","v":" ( LA), "}]
[]
["Items for LHC Reviewer Follow-Up"]
[]
["Worksheet","Row","Follow-Up Item"]
[]
["Project Description",{"$f":"ROW('Project Description'!A64)","v":64},{"$f":"IF(E10=\"Yes\",F10,\"\")","v":""},null,{"$f":"IF('Project Description'!H64=\"Yes\",\"Yes\",\"\")","v":""},"There is an IOI between the Developer and the Builder."]
[{"$f":"+A10","v":"Project Description"},{"$f":"ROW('Project Description'!A66)","v":66},{"$f":"IF(E11=\"Yes\",F11,\"\")","v":""},null,{"$f":"IF('Project Description'!H66=\"Yes\",\"Yes\",\"\")","v":""},"There is a potential 'not in good standing' issue."]
["Project Description",{"$f":"ROW('Project Description'!A158)","v":158},{"$f":"IF(E12=\"Yes\",F12,\"\")","v":""},null,{"$f":"IF(AND('Project Description'!H157=\"Yes\",'Project Description'!H95=\"New Construction\"),\"Yes\",\"\")","v":""},"The applicant says this is a Preservation Property but it's a new construction project."]
["Project Description",{"$f":"ROW('Project Description'!A179)","v":179},"",null,{"$f":"IF('Project Description'!B179=\"\",\"\",\"Yes\")","v":""},{"$f":"\"General pool selected; project appears eligible for \"&'Project Description'!M178","v":"General pool selected; project appears eligible for UrbanRehab"}]
[{"$f":"+A12","v":"Project Description"},{"$f":"ROW('Project Description'!A532)","v":532},"",null,{"$f":"IF('Project Description'!B532=\"\",\"\",\"Yes\")","v":""},{"$f":"+'Project Description'!B532","v":""}]
["Project Description",{"$f":"ROW('Project Description'!A533)","v":533},"",null,{"$f":"IF('Project Description'!B533=\"\",\"\",\"Yes\")","v":""},{"$f":"+'Project Description'!B533","v":""}]
["Project Description",{"$f":"ROW('Project Description'!A539)","v":539},"",null,{"$f":"IF('Project Description'!H539=\"Yes\",\"Yes\",\"\")","v":""},"Equipment owned by the Developer or Builder will be used."]
["Project Description",{"$f":"ROW('Project Description'!A559)","v":559},"",null,{"$f":"IF('Project Description'!H559=\"Yes\",\"Yes\",\"\")","v":""},"The TDC includes IOI costs other than the developer fee."]
["Project Description",{"$f":"ROW('Project Description'!A578)","v":578},"",null,{"$f":"IF('Project Description'!H578=0,\"\",\"Yes\")","v":""},{"$f":"\"See Section \"&G18&\" for description of community facilities.\"","v":"See Section 20.06 for description of community facilities."},{"$f":"+'Project Description'!L576","v":20.060000000000009}]
["Project Description",{"$f":"ROW('Project Description'!A585)","v":585},"",null,{"$f":"IF('Project Description'!H585=\"Yes\",\"Yes\",\"\")","v":""},{"$f":"\"See Section \"&G19&\" for description of the proposed Community Service Facility.\"","v":"See Section 20.07 for description of the proposed Community Service Facility."},{"$f":"+'Project Description'!L585","v":20.070000000000011}]
["Project Description",{"$f":"ROW('Project Description'!A586)","v":586},"",null,{"$f":"IF('Project Description'!H706='Project Description'!H707,\"\",\"Yes\")","v":""},{"$f":"\"See Section \"&G20&\": Applicant used an AMI that differs from the LHC database.\"","v":"See Section 23.02: Applicant used an AMI that differs from the LHC database."},{"$f":"+'Project Description'!L705","v":23.020000000000003}]
["Project Description",{"$f":"ROW('Project Description'!A634)","v":634},"",null,{"$f":"IF('Project Description'!M633='Project Description'!Q632,\"\",\"Yes\")","v":""},{"$f":"+'Project Description'!B634","v":"Set-Aside Selection Not Yet Made"}]
[{"$f":"+A20","v":"Project Description"},{"$f":"ROW('Project Description'!A725)","v":725},"",null,{"$f":"IF(OR('Project Description'!B725=\"\",'Project Description'!B725=0),\"\",\"Yes\")","v":""},{"$f":"\"See Section \"&G22&\": Applicant disagrees with calculated gross rents.\"","v":"See Section 23.03: Applicant disagrees with calculated gross rents."},{"$f":"+'Project Description'!L711","v":23.030000000000005}]
["Project Description",{"$f":"ROW('Project Description'!A767)","v":767},"",null,null,{"$f":"\"See Section \"&G23&\": Applicant disagrees with calculated net rents (after subtracting UAs).\"","v":"See Section 23.07: Applicant disagrees with calculated net rents (after subtracting UAs)."},{"$f":"+'Project Description'!L767","v":23.070000000000011}]
["Project Description",{"$f":"ROW('Project Description'!A797)","v":797},{"$error":"#N/A"},null,{"$f":"IF(OR('Project Description'!B798=\"\",'Project Description'!B798=0),\"\",\"Yes\")","v":{"$error":"#N/A"}},{"$f":"\"See Section \"&G24&\": One or more FMRs disagrees with LHC's database.\"","v":"See Section 23.11: One or more FMRs disagrees with LHC's database."},{"$f":"+'Project Description'!A797","v":23.110000000000017}]
["Project Description",{"$f":"ROW('Project Description'!A924)","v":924},"",null,{"$f":"IF(OR('Project Description'!B924=\"\",'Project Description'!B924=0),\"\",\"Yes\")","v":""},{"$f":"\"See Section \"&G25&\": On-Site Security points are claimed but there is no security expense.\"","v":"See Section 27.08: On-Site Security points are claimed but there is no security expense."},{"$f":"+'Project Description'!A916","v":27.080000000000013}]
["Project Description",{"$f":"ROW('Project Description'!A953)","v":953},"",null,{"$f":"IF('Project Description'!H952=\"Yes\",\"Yes\",\"\")","v":""},{"$f":"\"See Section \"&G26&\": Soft market requiring above-LHC-standard vacancy rate.\"","v":"See Section 28: Soft market requiring above-LHC-standard vacancy rate."},{"$f":"+'Project Description'!L950","v":28}]
["Project Description",{"$f":"ROW('Project Description'!A971)","v":971},{"$f":"IF(E27=\"Yes\",\"The applicant entered a non-zero trending rate for the ADRR\",\"\")","v":""},null,{"$f":"IF('Project Description'!H971=0,\"\",\"Yes\")","v":""}]
[{"$f":"+A26","v":"Project Description"},{"$f":"ROW('Project Description'!A977)","v":977},"",null,{"$f":"IF('Project Description'!H977=\"Yes\",\"Yes\",\"\")","v":""},{"$f":"\"See Section \"&G28&\": HUD or RD regulates the annual reserve deposit.\"","v":"See Section 28: HUD or RD regulates the annual reserve deposit."},{"$f":"+'Project Description'!L950","v":28}]
["Project Description",{"$f":"ROW('Project Description'!A982)","v":982},{"$f":"IF(E29=\"Yes\",\"There are non-LHC requirements governing the Replacement Reserve\",\"\")","v":""},null,{"$f":"IF('Project Description'!H982=\"Yes\",\"Yes\",\"\")","v":""}]
[{"$f":"+A26","v":"Project Description"},{"$f":"ROW('Project Description'!A1048)","v":1048},"",null,{"$f":"IF(OR('Project Description'!B1048=\"\",'Project Description'!B1048=0),\"\",\"Yes\")","v":""},{"$f":"\"See Section \"&G30&\": One or more LHC fees does not match the calculated amount.\"","v":"See Section 32: One or more LHC fees does not match the calculated amount."},{"$f":"+'Project Description'!L1027","v":32}]
["Development Costs",{"$f":"ROW('Development Costs'!A160)","v":160},null,null,{"$f":"IF(SUM('Development Costs'!C160:C163)=0,\"\",\"Yes\")","v":""},{"$f":"\"See Section \"&G31&\": The applicant made custom adjustments to Acquisition Basis.\"","v":"See Section 38.01: The applicant made custom adjustments to Acquisition Basis."},{"$f":"+'Development Costs'!A157","v":38.01}]
["Development Costs",{"$f":"ROW('Development Costs'!A185)","v":185},"",null,{"$f":"IF(SUM('Development Costs'!C185:C191)=0,\"\",\"Yes\")","v":""},{"$f":"\"See Section \"&G32&\": The applicant made custom adjustments to Construction Basis.\"","v":"See Section 38.02: The applicant made custom adjustments to Construction Basis."},{"$f":"+'Development Costs'!A168","v":38.019999999999996}]
["Revenues and Expenses",{"$f":"ROW('Revenues and Expenses'!A53)","v":53},"",null,{"$f":"IF(OR('Revenues and Expenses'!B91=\"\",'Revenues and Expenses'!B91=0),\"\",\"Yes\")","v":""},{"$f":"\"See Section \"&G33&\": This is an elevator building with no elevator maintenance expense budgeted.\"","v":"See Section 44.22: This is an elevator building with no elevator maintenance expense budgeted."},{"$f":"+'Revenues and Expenses'!A53","v":44.219999999999956}]
["App 2 Site Control",41,"",null,{"$f":"IF('App 2 Site Control'!I43<>0,\"Yes\",\"\")","v":""},"Appendix 2 indicates there is ground rent; check Revenues and Expenses for annual ground rent, and check Uses of Funds for prepaid ground rent."]
[null,null,""]
[null,null,""]
[null,null,""]
[null,null,""]
[null,null,""]
[null,null,""]
[null,null,""]
[null,null,""]
[null,null,""]
[null,null,""]
[null,null,""]
[null,null,""]
[null,null,""]
[null,null,""]
[null,null,""]
[null,null,""]
[null,null,{"$f":"IF(E51=0,\"\",E51)","v":""}]
[null,null,""]
[null,null,""]
[null,null,""]
[null,null,""]
[null,null,""]
[null,null,""]
[null,null,""]
[null,null,""]
[null,null,""]
[null,null,""]
[null,null,""]
[null,null,""]
[null,null,""]
[null,null,""]
[null,null,""]
[null,null,""]

{"sheet":"Development Team","index":18,"n_rows":102,"n_cols":6,"rows_kept":102,"cut":false,"hidden":false,"merged":[[98,2,98,5],[99,2,99,5],[86,2,86,5],[87,2,87,5],[91,2,91,5],[92,2,92,5],[93,2,93,5],[97,2,97,5],[85,2,85,5],[60,2,60,5],[61,2,61,5],[66,2,66,5],[67,2,67,5],[68,2,68,5],[72,2,72,5],[73,2,73,5],[74,2,74,5],[79,2,79,5],[80,2,80,5],[81,2,81,5],[3,0,3,5],[7,2,7,5],[8,2,8,5],[9,2,9,5],[59,2,59,5],[37,3,37,5],[45,3,45,5],[31,2,31,5],[32,2,32,5],[33,2,33,5],[39,2,39,5],[40,2,40,5],[41,2,41,5],[47,2,47,5],[48,2,48,5],[49,2,49,5]]}
[]
[]
[{"$f":"+Instructions!A3","v":"2025 QAP Underwriting Application v1.1"}]
[{"$f":"TRIM('Project Description'!E84)&\" (\"&TRIM('Project Description'!E86)&\" LA), \"&'Project Description'!E50","v":" ( LA), "}]
[]
["Development Team"]
[]
[null,"Developer:",{"$f":"+'Project Description'!E50","v":0}]
[null,null,{"$f":"+'Project Description'!E51","v":0}]
[null,null,{"$f":"+'Project Description'!E52","v":0}]
[]
[null,null,"Contact:",{"$f":"+'Project Description'!E39","v":0},"Phone:",{"$f":"+'Project Description'!E40","v":0}]
[]
[null,null,"E-Mail Address: ",{"$f":"+'Project Description'!E41","v":0}]
[]
[null,"Taxpayer:",{"$f":"+'Project Description'!E36","v":0}]
[null,null,{"$f":"+'Project Description'!E37","v":0}]
[null,null,{"$f":"+'Project Description'!E38","v":0}]
[]
[null,null,"Contact:",{"$f":"+'Project Description'!E39","v":0},"Phone:",{"$f":"+'Project Description'!E40","v":0}]
[]
[null,null,"E-Mail Address: ",{"$f":"+'Project Description'!E41","v":0}]
[]
[null,{"$f":"+'Project Description'!E46","v":0},{"$f":"+'Project Description'!E45","v":0}]
[null,{"$f":"+'Project Description'!E44","v":0},{"$f":"+C17","v":0}]
[null,null,{"$f":"+C18","v":0}]
[]
[null,null,"Contact:",{"$f":"+D20","v":0},"Phone:",{"$f":"+F20","v":0}]
[]
[null,null,"E-Mail Address: ",{"$f":"+D22","v":0}]
[]
[null,"Sponsor:"]
[]
[]
[]
[null,null,"Contact:",null,"Phone:"]
[]
[null,null,"E-Mail Address: "]
[]
[null,"Consultant:"]
[]
[]
[]
[null,null,"Contact:",null,"Phone:"]
[]
[null,null,"E-Mail Address: "]
[]
[null,"Fiscal Member/Partner:"]
[]
[]
[]
[null,null,"Contact:",null,"Phone:"]
[]
[null,"Syndicator:",{"$f":"IF(Syndication!E12=0,\"\",Syndication!E12)","v":""}]
[null,null,{"$f":"IF(Syndication!E13=0,\"\",Syndication!E13)","v":""}]
[null,null,{"$f":"IF(Syndication!E14=0,\"\",Syndication!E14)","v":""}]
[]
[null,null,"Contact:",{"$f":"IF(Syndication!F16=0,\"\",Syndication!F16)","v":""},"Phone:",{"$f":"IF(Syndication!H16=0,\"\",Syndication!H16)","v":""}]
[]
[null,"Attorney:"]
[]
[]
[]
[null,null,"Contact:",null,"Phone:"]
[]
[]
[null,"Accountant:"]
[null,"(Independent 3rd Party)"]
[]
[]
[null,null,"Contact:",null,"Phone:"]
[]
[null,"Construction Mortgage"]
[null,"Lender:"]
[]
[]
[null,null,"Contact:",null,"Phone:"]
[]
[]
[null,"Permanent Mortgage"]
[null,"Lender:"]
[]
[]
[null,null,"Contact:",null,"Phone:"]
[]
[null,"Management Co.:"]
[]
[]
[]
[null,null,"Contact:",null,"Phone:"]
[]
[null,"Architect:"]
[]
[]
[]
[null,null,"Contact:",null,"Phone:"]
[]
[null,"Builder / Contractor:"]
[]
[]
[]
[null,null,"Contact:",null,"Phone:"]

{"sheet":"Syndication","index":19,"n_rows":185,"n_cols":18,"rows_kept":185,"cut":false,"hidden":false,"merged":[[182,6,182,9],[185,6,185,9],[167,1,167,9],[172,1,172,9],[152,7,152,9],[175,7,175,9],[136,1,136,9],[143,2,143,9],[161,6,161,9],[131,3,131,5],[131,6,131,8],[132,3,132,5],[132,6,132,8],[133,3,133,5],[133,6,133,8],[118,1,118,9],[120,2,120,9],[129,3,129,5],[129,6,129,8],[130,3,130,5],[130,6,130,8],[126,6,126,8],[127,6,127,8],[128,6,128,8],[124,6,124,8],[125,6,125,8],[112,3,112,5],[113,3,113,5],[114,3,114,5],[115,3,115,5],[111,6,111,8],[112,6,112,8],[113,6,113,8],[114,6,114,8],[115,6,115,8],[71,4,71,7],[76,6,76,9],[84,4,84,7],[85,4,85,7],[90,6,90,9],[62,2,62,9],[66,4,66,7],[67,4,67,7],[68,4,68,7],[70,4,70,7],[108,6,108,8],[109,6,109,8],[110,6,110,8],[111,3,111,5],[80,4,80,7],[81,4,81,7],[82,4,82,7],[107,6,107,8],[92,2,92,9],[106,6,106,8],[58,2,58,4],[59,2,59,4],[60,2,60,4],[55,2,55,4],[56,2,56,4],[57,2,57,4],[52,2,52,4],[53,2,53,4],[54,2,54,4],[49,2,49,4],[50,2,50,4],[51,2,51,4],[3,0,3,10],[47,2,47,4],[48,2,48,4],[15,4,15,7],[46,2,46,4],[42,2,42,9],[7,2,7,9],[11,4,11,7],[13,4,13,7],[12,4,12,7],[16,4,16,7]]}
[]
[]
[{"$f":"+Instructions!A3","v":"2025 QAP Underwriting Application v1.1"}]
[{"$f":"TRIM('Project Description'!E84)&\" (\"&TRIM('Project Description'!E86)&\" LA), \"&'Project Description'!E50","v":" ( LA), "}]
[]
["Syndication Information and Certification"]
[]
[null,"I.","Syndication Commitment: A Commitment attached hereto as Exhibit A has been received from the Syndicator (named below) to purchase an ownership interest in the Taxpayer/Applicant for the total dollar amount specified below (the \"Syndication Proceeds\") in the percentage specified below in connection with the Low-Income Housing Credits specified in the Commitment:"]
[]
[null,null,"A.","Syndicator Information (see Glossary for definition of 'Syndicator')"]
[]
[null,null,null,"Name:"]
[null,null,null,"Address:"]
[]
[]
[null,null,null,"Telephone:"]
[null,null,null,"Contact:"]
[]
[null,null,"B.","Percentage Interest in Taxpayer to be Acquired by Syndicator:"]
[]
[null,null,"C.","% Interest in Taxpayer to be Retained by Sponsor/Developer:",null,null,null,null,null,{"$f":"1-J19","v":1}]
[]
[null,null,"D.","Amount of Tax Credits Specified in Commitment:",null,null,null,null,null,{"$f":"+'Project Description'!H204","v":0}]
[]
[null,null,"E.","Syndication Proceeds Generated by Syndicator (Prior to Subtraction"]
[null,null,null," of Syndication Costs):",null,null,null,null,null,null,null,null,{"$f":"IF(J23=0,0,+J26/(J23*J19*10))","v":0},"calculated syndication price"]
[]
[null,null,"F.","Gross Equity to be invested in Taxpayer by Syndicator:",null,null,null,null,null,{"$f":"+'Project Description'!E432","v":0}]
[]
[null,null,"G.","Syndication Costs Paid by Syndicator (E-F):",null,null,null,null,null,{"$f":"J26-J28","v":0}]
[]
[null,null,"H.","Syndication Costs Paid by Developer (VI.10):",null,null,null,null,null,{"$f":"+J135","v":0},null,null,{"$f":"+'Development Costs'!D106","v":0},"from Development Costs worksheet"]
[null,null,null,{"$f":"IF(J32='Development Costs'!D106,\"\",\"Doesn't Match Total Syndication Costs (\"&TEXT('Development Costs'!D106,\"#,##0\")&\") from the Dev. Costs worksheet.\")","v":""}]
[]
[null,null,"I.","Total Syndication Costs (G+H):",null,null,null,null,null,{"$f":"+J30+J32","v":0}]
[]
[null,null,"J.","Total Syndication Costs as a % of Syndication Proceeds (I/E):*",null,null,null,null,null,{"$f":"IF(J26>0, J35/J26, 0)","v":0}]
[]
[null,null,"K.","Total Syndication Proceeds Available  (F-H):",null,null,null,null,null,{"$f":"+J28-J32","v":0}]
[null,null,"________________"]
[null,null,"* If syndication is public, may not exceed 15%.  If syndication is private, may not exceed 10%."]
[]
[null,"II.","Disbursement of Gross Equity by Installment: The Gross Equity will be invested in the Taxpayer by the Syndicator in the following installments:"]
[]
[null,null,"Event",null,null,"   Date   ",null,"Percentage",null,"Installment"]
[]
[null,"1)",null,null,null,null,null,0,null,0]
[null,"2)",null,null,null,null,null,0,null,0]
[null,"3)",null,null,null,null,null,0,null,0]
[null,"4)",null,null,null,null,null,0,null,0]
[null,"5)",null,null,null,null,null,0,null,0]
[null,"6)",null,null,null,null,null,0,null,0]
[null,"7)",null,null,null,null,null,0,null,0]
[null,"8)",null,null,null,null,null,0,null,0]
[null,"9)",null,null,null,null,null,0,null,0]
[null,"10)",null,null,null,null,null,0,null,0]
[null,"11)",null,null,null,null,null,0,null,0]
[null,"12)",null,null,null,null,null,0,null,0]
[null,"13)",null,null,null,null,null,0,null,0]
[null,"14)",null,null,null,null,null,0,null,0]
[null,"15)",null,null,null,null,null,0,null,0]
[null,null,null,null,null,{"$f":"IF(ROUND(SUM(J47:J61),-1)<>ROUND(J28,-1), \"WARNING - Does not agree with Line F above.\", \"\")","v":""}]
[null,"III.","Sources of Interim Financing From Commercial Lenders: The following constitutes the source of Bridge Loan Costs and/or other Interim Financing Devices from commercial lenders:"]
[]
[null,null,"A.","Interim Funds from Commercial Lender #1:"]
[]
[null,null,null,"Name:"]
[null,null,null,"Address:"]
[]
[]
[null,null,null,"Telephone:"]
[null,null,null,"Contact:"]
[]
[null,null,null,"Loan Amount:",null,null,null,null,null,0]
[null,null,null,"Interest Rate:",null,0,"per annum "]
[null,null,null,"Estimate Total Interest Payments:",null,null,null,null,null,0]
[null,null,null,"Security for Interim Funds:"]
[]
[null,null,"B.","Interim Funds from Commercial Lender #2:"]
[]
[null,null,null,"Name:"]
[null,null,null,"Address:"]
[]
[]
[null,null,null,"Telephone:"]
[null,null,null,"Contact:"]
[]
[null,null,null,"Loan Amount:",null,null,null,null,null,0]
[null,null,null,"Interest Rate:",null,0,"per annum "]
[null,null,null,"Estimate Total Interest Payments:",null,null,null,null,null,0]
[null,null,null,"Security for Interim Funds:"]
[]
[null,"IV.","Identity of Interest Information With Respect to Commercial Loans:  The terms of the interim financing specified in Section III above were negotiated in good faith and on an \"arm's-length\" basis.   There is no identity-of-interest between the entities listed in the Sources of Interim Funds and any partners or investors in the Taxpayer/Applicant."]
[]
[null,"V.","Interim Funds from Syndicator and Syndication Costs:"]
[]
[null,null,"A.","The Syndicator will provide interim financing of ",null,null,null,null,null,0]
[null,null,null,"at an interest rate of",null,null,null,null,null,0]
[null,null,null,"per annum and expects to receive ",null,null,null,null,null,0]
[null,null,null,"of interest on funds loaned to the Taxpayer by the Syndicator."]
[]
[null,null,"B.","The following amounts represent syndication expenses to be incurred and paid by the "]
[null,null,null,"Syndicator in obtaining cash to invest in the Taxpayer:"]
[]
[null,null,"   Items  ",null,null,null,"  Payee*  ",null,null,"  Amounts*  "]
[]
[null,1,"Accountant's Fee Paid by Syndicator",null,null,null,0,null,null,0]
[null,2,"Syndicator's Fee",null,null,null,0,null,null,0]
[null,3,"Attorney's Fee Paid by Syndicator",null,null,null,0,null,null,0]
[null,4,"Broker Fees Paid by Syndicator",null,null,null,0,null,null,0]
[null,5,"Organizational Expense of Syndication",null,null,null,0,null,null,0]
[null,6,"Other:",0,null,null,0,null,null,0]
[null,7,"Other:",0,null,null,0,null,null,0]
[null,8,"Other:",0,null,null,0,null,null,0]
[null,9,"Other:",0,null,null,0,null,null,0]
[null,10,"Other:",0,null,null,0,null,null,0]
[null,null,"TOTAL:",null,null,{"$f":"IF(J117=J30, \"\", \"This doesn't match Section I, Line G!\")","v":""},null,null,null,{"$f":"+SUM(J107:J116)","v":0},null,null,{"$f":"+J30","v":0},"Syndication Costs paid by Syndicator (Line I.G above)"]
[null,"_____________"]
[null,"* All amounts must relate solely to the Syndication and must be amounts specifically approved and paid by the Syndicator.  No amounts should be shown without specifying the name of a payee and no amounts shown may be paid by the Taxpayer or Developer."]
[]
[null,"VI.","Syndication Costs Paid by Taxpayer or Developer:  The following amounts represent syndication expenses to be incurred and paid by the Taxpayer or Developer in obtaining cash to invest in the Taxpayer:"]
[]
[null,null,"   Items  ",null,null,null,"  Payee*  ",null,null,"  Amounts*  "]
[]
[null,1,"Accountant's Fee Paid by Taxpayer",null,null,null,0,null,null,0]
[null,2,"Taxpayer's Fee",null,null,null,0,null,null,0]
[null,3,"Attorney's Fee Paid by Taxpayer",null,null,null,0,null,null,0]
[null,4,"Broker Fees Paid by Taxpayer",null,null,null,0,null,null,0]
[null,5,"Organizational Expense of Syndication",null,null,null,0,null,null,0]
[null,6,"Other:",0,null,null,0,null,null,0]
[null,7,"Other:",0,null,null,0,null,null,0]
[null,8,"Other:",0,null,null,0,null,null,0]
[null,9,"Other:",0,null,null,0,null,null,0]
[null,10,"Other:",0,null,null,0,null,null,0]
[null,null,"TOTAL:",null,null,{"$f":"IF(J135=J32, \"\", \"This doesn't match Section I, Line H!\")","v":""},null,null,null,{"$f":"+SUM(J125:J134)","v":0}]
[null,"_____________"]
[null,"* All amounts must relate solely to the Syndication and must be amounts specifically approved and paid by the Syndicator.  No amounts should be shown without specifying the name of a payee and no amounts shown may be paid by the Taxpayer or Developer."]
[]
[null,"VII.","Net Equity:"]
[]
[null,null,"The estimated Placed in Service Date is",null,null,null,null,null,null,{"$f":"+M141","v":"00:00:00"},null,null,{"$f":"+'Project Description'!H274","v":"00:00:00"},"Placed In Service Date for Last Building",null,null,null,{"$f":"\"See Section \"&TEXT('Project Description'!A274,\"0.00\")","v":"See Section 16.30"}]
[null,null,"The Net Equity* as of the Estimated Placed in Service Date is",null,null,null,null,null,null,{"$f":"+J150","v":0}]
[]
[null,null,"*  Compute Net Equity by (i) compounding Installments from Part II above in advance of the Placed In Service Date by the Compound Factor, (ii) discounting Installments following the Placed In Service Date by the Discount Factor, (iii) adding the sum total of adjusted Installments from (i) and (ii).  The Compound Factor and the Discount Factor for purposes of the Application will be determined as of January 1st of the year in which the Application is submitted and will be based on the yield as of such date on the six (6) month T-Bill plus two (2) percent."]
[]
[null,null,"Please evidence this calculation as follows:"]
[]
[null,null,"(i)","Compounding Installments prior to Placed In Service Date:",null,null,null,null,null,0]
[null,null,"(ii)","Discounting Installments Following Placed In Service Date:",null,null,null,null,null,0]
[null,null,"(iii)","Net Equity [Add (i) plus (ii)]:",null,null,null,null,null,{"$f":"+J148+J149","v":0}]
[]
[]
[null,"WITNESS my signature, on this the",null,null,null,null,"day of"]
[]
[]
[]
[]
[null,null,null,null,null,null,{"$f":"'Project Description'!E36&\" (Taxpayer)\"","v":" (Taxpayer)"}]
[]
[]
[null,null,null,null,null,"By:"]
[]
[]
[]
[null,"Notary"]
[]
[]
[null,"The undersigned duly authorized representative of the Syndicator hereby certifies as follows:  (1) The information contained in this Syndication Information and Certification is true and correct as of the date of its execution by the Taxpayer/Applicant; and (2) The syndication of the tax credits requested by the Syndicator has been or will be (check one):"]
[]
[null,null,null,null,"Publicly Offered*",null,null,null,null,null,null,null,{"$f":"IF(D170=\"\",\"Private\",\"Public\")","v":"Private"}]
[null,null,{"$f":"IF(D170=\"\",\"\",D170)","v":""},"x","Privately Placed"]
[null,null,null,{"$f":"IF(D170<>\"\",IF(D171<>\"\",\"You can only check one block!\",\"\"),IF(D171=\"\",\"You must check at least one block!\",\"\"))","v":""}]
[null,"* If the syndication proceeds are generated through public offering, please submit copy of all filings with the SEC as Appendix B."]
[]
[]
[null,"WITNESS my signature, on this the",null,null,null,null,"day of"]
[]
[]
[]
[null,null,null,null,null,null,{"$f":"E12&\" (Syndicator)\"","v":" (Syndicator)"}]
[]
[null,null,null,null,null,"By:"]
[]
[]
[null,null,null,null,null,"Title:"]

{"sheet":"Taxpayer Certification","index":20,"n_rows":30,"n_cols":9,"rows_kept":30,"cut":false,"hidden":false,"merged":[[3,0,3,6],[17,3,17,5],[7,1,7,6],[8,1,8,6],[9,1,9,6],[10,1,10,6],[11,1,11,6]]}
[]
[]
[{"$f":"+Instructions!A3","v":"2025 QAP Underwriting Application v1.1"}]
[{"$f":"TRIM('Project Description'!E84)&\" (\"&TRIM('Project Description'!E86)&\" LA), \"&'Project Description'!E50","v":" ( LA), "}]
[]
["Taxpayer / Applicant Certification"]
[null," "]
[null,"The undersigned Taxpayer or duly authorized representative of the same hereby certifies that the information contained in the Low Income Tax Credit Application Package, including all appendices and Exhibits attached hereto is complete and accurate as of the date hereof.  The undersigned acknowledges that the information provided in this Application package or in any other document, release or communication by the Louisiana Housing Corporation (the \"Corporation\") has not been relied upon for purpose of making any investment decision by the Taxpayer and that any and all expenses and investments with respect to this application for an allocation of low-income housing tax credits have been or will be made on the basis of an independent judgement by the Taxpayer or upon consultation with a qualified tax consultant."]
[null,"The Taxpayer hereby certifies that the project can be completed and operated within the development schedule and budget set forth in the Application."]
[null,"The Taxpayer represents that it will furnish promptly such other supporting information, documents and fees as may be requested and/or required.  In carrying out the development and operation of the project, the Taxpayer agrees to comply with all applicable federal and state laws regarding unlawful discrimination and will abide by all Corporation rules and regulations.  The Taxpayer understands and agrees that the Corporation is not responsible for actions taken by the Taxpayer in reliance on a prospective tax credit reservation by the Corporation and the Taxpayer further agrees that the Corporation, its employees, agents and/or consultants shall not be responsible or liable in any manner whatsoever for expenses incurred by Taxpayer or its consultants in applying for low income housing tax credits. "]
[null," By execution of this Application, the Taxpayer understands and agrees that the Corporation may conduct its own independent review and analysis of the information contained herein and in the attachments hereto, that any such review and analysis will be made for the protection of the Corporation.  It is further understood and agreed by the Taxpayer that, for the purpose of determining and establishing the terms and conditions under which the allocation may be made, the Corporation may request or require adjustment or changes in the information contained herein (including attachments hereto) or in any documentation or materials now or hereafter submitted in connection with this Application."]
[null,"The Taxpayer acknowledges that a certification of information contained in this Application will be made as of the date the Corporation reserves or allocates tax credits for the Project and as of the Placed in Service Date of the Project and that the amount of tax credits reserved and/or allocated pursuant to any forward commitment or carry forward allocation may be revised or adjusted in accordance with the feasibility/viability review as of such Placed in Service Date and in accordance with the audit of the Certificate of Actual Costs.  The Taxpayer further acknowledges that the Tax Credit Regulatory Agreement (including the Compliance Monitoring Agreement attached thereto) shall be entered into prior to or simultaneously with the allocation of tax credits by the Corporation or within any year of the compliance period.  The Taxpayer shall hold the Corporation, its employees, agents and/or consultants harmless in connection with any claims of damage which may be filed by the Taxpayer based upon the processing of this Application by the Corporation or its agents, employees and/or consultants."]
[null,{"$f":"\"WITNESS my signature on \"&TEXT(D28,\"mmmm d yyyy\")","v":"WITNESS my signature on January 0 1900"},null,{"$f":"+'Project Description'!E36&\" (Taxpayer)\"","v":" (Taxpayer)"}]
[]
[]
[]
[null,null,"By:"]
[null,null,null,null,null,null,null,null,"Sworn to and subscribed before me "]
[]
[null,{"$f":"I18&TEXT(D29,\"mmmm d yyyy\")","v":"Sworn to and subscribed before me January 0 1900"}]
[]
[]
[]
[]
[null,{"$f":"\"Notary Public, State of \"&D30","v":"Notary Public, State of "}]
[]
[]
[null,"Date of Taxpayer Certification:"]
[null,"Date of Notarization:"]
[null,"State for Notary Public:"]

{"sheet":"Reserve Adequacy","index":21,"n_rows":36,"n_cols":16,"rows_kept":36,"cut":false,"hidden":false,"merged":[]}
[]
[]
[{"$f":"+Instructions!A3","v":"2025 QAP Underwriting Application v1.1"}]
[{"$f":"TRIM('Project Description'!E84)&\" (\"&TRIM('Project Description'!E86)&\" LA), \"&'Project Description'!E50","v":" ( LA), "}]
[]
["Analysis of Replacement Reserve Adequacy",null,null,null,{"$f":"IF(Checklist!A170=\"Yes\",\"\",\"This exhibit is not required (no CNA is required for this transaction)\")","v":"This exhibit is not required (no CNA is required for this transaction)"}]
[]
[null,"Year 1","Year 2","Year 3","Year 4","Year 5","Year 6","Year 7","Year 8","Year 9","Year 10","Year 11","Year 12","Year 13","Year 14","Year 15"]
[]
["Beginning Balance",{"$f":"+B20","v":0},{"$f":"+B15","v":0},{"$f":"+C15","v":0},{"$f":"+D15","v":0},{"$f":"+E15","v":0},{"$f":"+F15","v":0},{"$f":"+G15","v":0},0,0,0,0,0,0,0,0]
[{"$f":"\"+ Annual Deposit\"","v":"+ Annual Deposit"},{"$f":"+B21","v":0},{"$f":"ROUND(B11*(1+B22),0)","v":0},{"$f":"ROUND(C11*(1+B22),0)","v":0},{"$f":"ROUND(D11*(1+B22),0)","v":0},{"$f":"ROUND(E11*(1+B22),0)","v":0},{"$f":"ROUND(F11*(1+B22),0)","v":0},{"$f":"ROUND(G11*(1+B22),0)","v":0},{"$f":"ROUND(H11*(1+B22),0)","v":0},{"$f":"ROUND(I11*(1+B22),0)","v":0},{"$f":"ROUND(J11*(1+B22),0)","v":0},{"$f":"ROUND(K11*(1+B22),0)","v":0},{"$f":"ROUND(L11*(1+B22),0)","v":0},{"$f":"ROUND(M11*(1+B22),0)","v":0},{"$f":"ROUND(N11*(1+B22),0)","v":0},{"$f":"ROUND(O11*(1+B22),0)","v":0}]
[{"$f":"\"- Anticipated Needs\"","v":"- Anticipated Needs"},{"$f":"-B31","v":0},{"$f":"-C31","v":0},0,0,0,0,0,0,0,0,0,0,0,0,0]
[{"$f":"\"+ Interest at \"&TEXT(B23,\"#0.00%\")","v":"+ Interest at 1.00%"},{"$f":"ROUND((B10+MIN(0,B11+B12))*B23,0)","v":0},{"$f":"ROUND((C10+MIN(0,C11+C12))*B23,0)","v":0},{"$f":"ROUND((D10+MIN(0,D11+D12))*B23,0)","v":0},{"$f":"ROUND((E10+MIN(0,E11+E12))*B23,0)","v":0},{"$f":"ROUND((F10+MIN(0,F11+F12))*B23,0)","v":0},{"$f":"ROUND((G10+MIN(0,G11+G12))*B23,0)","v":0},{"$f":"ROUND((H10+MIN(0,H11+H12))*B23,0)","v":0},{"$f":"ROUND((I10+MIN(0,I11+I12))*B23,0)","v":0},{"$f":"ROUND((J10+MIN(0,J11+J12))*B23,0)","v":0},{"$f":"ROUND((K10+MIN(0,K11+K12))*B23,0)","v":0},{"$f":"ROUND((L10+MIN(0,L11+L12))*B23,0)","v":0},{"$f":"ROUND((M10+MIN(0,M11+M12))*B23,0)","v":0},{"$f":"ROUND((N10+MIN(0,N11+N12))*B23,0)","v":0},{"$f":"ROUND((O10+MIN(0,O11+O12))*B23,0)","v":0},{"$f":"ROUND((P10+MIN(0,P11+P12))*B23,0)","v":0}]
[]
["   Ending Balance",{"$f":"SUM(B9:B14)","v":0},0,0,0,0,0,0,0,0,0,0,0,0,0,0]
["   Per Unit",{"$f":"IF(B25=0,0,B15/B25)","v":0},{"$f":"IF(B25=0,0,C15/B25)","v":0},{"$f":"IF(B25=0,0,D15/B25)","v":0},{"$f":"IF(B25=0,0,E15/B25)","v":0},{"$f":"IF(B25=0,0,F15/B25)","v":0},{"$f":"IF(B25=0,0,G15/B25)","v":0},{"$f":"IF(B25=0,0,H15/B25)","v":0},{"$f":"IF(B25=0,0,I15/B25)","v":0},{"$f":"IF(B25=0,0,J15/B25)","v":0},{"$f":"IF(B25=0,0,K15/B25)","v":0},{"$f":"IF(B25=0,0,L15/B25)","v":0},{"$f":"IF(B25=0,0,M15/B25)","v":0},{"$f":"IF(B25=0,0,N15/B25)","v":0},{"$f":"IF(B25=0,0,O15/B25)","v":0},{"$f":"IF(B25=0,0,P15/B25)","v":0}]
["Ending balance problem?",{"$f":"IF(B16<B26,\"Problem\",\"\")","v":""},{"$f":"IF(C16<B26,\"Problem\",\"\")","v":""},{"$f":"IF(D16<B26,\"Problem\",\"\")","v":""},{"$f":"IF(E16<B26,\"Problem\",\"\")","v":""},{"$f":"IF(F16<B26,\"Problem\",\"\")","v":""},{"$f":"IF(G16<B26,\"Problem\",\"\")","v":""},{"$f":"IF(H16<B26,\"Problem\",\"\")","v":""},{"$f":"IF(I16<B26,\"Problem\",\"\")","v":""},{"$f":"IF(J16<B26,\"Problem\",\"\")","v":""},{"$f":"IF(K16<B26,\"Problem\",\"\")","v":""},{"$f":"IF(L16<B26,\"Problem\",\"\")","v":""},{"$f":"IF(M16<B26,\"Problem\",\"\")","v":""},{"$f":"IF(N16<B26,\"Problem\",\"\")","v":""},{"$f":"IF(O16<B26,\"Problem\",\"\")","v":""},{"$f":"IF(P16<B26,\"Problem\",\"\")","v":""}]
[]
["Inputs:"]
["Initial Deposit",{"$f":"+'Development Costs'!C101","v":0}," (from Development Costs worksheet)"]
["Annual Deposit (Year 1)",{"$f":"'Project Description'!H987","v":0},{"$f":"\" (from Section \"&'Project Description'!L950&\")\"","v":" (from Section 28)"},null,null,null,{"$f":"AVERAGE(B29:P29)","v":0},"average annual uninflated capital needs",null,null,null,{"$f":"AVERAGE(B31:P31)","v":0},"average annual inflated capital needs"]
["Annual deposit escalation",{"$f":"+'Project Description'!H971","v":0},{"$f":"\" (from Section \"&'Project Description'!L950&\")\"","v":" (from Section 28)"}]
["Interest Rate",0.01," (LHC standard)"]
["Inflation Rate",0.02," (LHC standard)"]
["Total Units",{"$f":"+'Unit Mix and Rents'!F41","v":0}," (from Unit Mix and Rents worksheet)"]
["Minimum Balance Per Unit",{"$f":"IF(B25=0,0,ROUND(MAX(B11:P11)/6/B25,0))","v":0}," (per QAP definition of Minimum Reserve Balance)"]
[]
[null,{"$f":"+B8","v":"Year 1"},"Year 2","Year 3","Year 4","Year 5","Year 6","Year 7","Year 8","Year 9","Year 10","Year 11","Year 12","Year 13","Year 14","Year 15"]
["Capital Needs (uninflated)",0,0,0,0,0,0,0,0,0,0,0,0,0,0,0]
["Inflation Factor",1,{"$f":"+B30*(1+B24)","v":1.02},{"$f":"+C30*(1+B24)","v":1.0404},{"$f":"+D30*(1+B24)","v":1.0612079999999999},{"$f":"+E30*(1+B24)","v":1.08243216},{"$f":"+F30*(1+B24)","v":1.1040808032},{"$f":"+G30*(1+B24)","v":1.1261624192640001},{"$f":"+H30*(1+B24)","v":1.14868566764928},{"$f":"+I30*(1+B24)","v":1.1716593810022657},{"$f":"+J30*(1+B24)","v":1.1950925686223111},{"$f":"+K30*(1+B24)","v":1.2189944199947573},{"$f":"+L30*(1+B24)","v":1.2433743083946525},{"$f":"+M30*(1+B24)","v":1.2682417945625455},{"$f":"+N30*(1+B24)","v":1.2936066304537963},{"$f":"+O30*(1+B24)","v":1.3194787630628724}]
["Capital Needs (inflated)",{"$f":"ROUND(B29*B30,0)","v":0},{"$f":"ROUND(C29*C30,0)","v":0},0,0,0,0,0,0,0,0,0,0,0,0,0]
[]
[]
[]
[0.35,{"$f":"+B36*A35","v":0},{"$f":"+C36*A35","v":15657.249999999998},{"$f":"+D36*A35","v":36157.1},{"$f":"+E36*A35","v":45608.85},{"$f":"+F36*A35","v":73378.549999999988},{"$f":"+G36*A35","v":61160.049999999996},{"$f":"+H36*A35","v":67405.8},{"$f":"+I36*A35","v":40906.6},{"$f":"+J36*A35","v":20623.05},{"$f":"+K36*A35","v":26548.55},{"$f":"+L36*A35","v":32116.699999999997},{"$f":"+M36*A35","v":43943.199999999997},{"$f":"+N36*A35","v":37819.599999999999},{"$f":"+O36*A35","v":42477.75},{"$f":"+P36*A35","v":49092.399999999994}]
[null,0,44735,103306,130311,209653,174743,192588,116876,58923,75853,91762,125552,108056,121365,140264]

{"sheet":"App 1 Owner Info","index":22,"n_rows":75,"n_cols":12,"rows_kept":75,"cut":false,"hidden":false,"merged":[[43,2,43,7],[44,2,44,7],[45,2,45,7],[49,2,49,7],[3,0,3,7],[29,2,29,4],[31,2,31,4],[33,2,33,4],[7,0,7,7],[24,1,24,7],[37,1,37,7],[41,2,41,7],[42,2,42,7],[65,5,65,7],[50,2,50,7],[51,2,51,7],[52,2,52,7],[53,2,53,7],[59,2,60,3],[55,1,55,7]]}
[]
[]
[{"$f":"+Instructions!A3","v":"2025 QAP Underwriting Application v1.1"}]
[{"$f":"TRIM('Project Description'!E84)&\" (\"&TRIM('Project Description'!E86)&\" LA), \"&'Project Description'!E50","v":" ( LA), "}]
[]
["Appendix 1: Ownership Information"]
[]
["Note:  The Corporation reserves tax credits to the Taxpayer and the controlling party of the Taxpayer.  Reservations are not transferrable.  Any change in controlling party is deemed a material change."]
[]
[null,"Taxpayer Entity Name:",null,{"$f":"+'Project Description'!E36","v":0}]
[null,"Taxpayer Is:",null,{"$f":"+'Project Description'!E43","v":0}]
[null,"Taxpayer Federal Tax ID Number:",null,{"$f":"+'Project Description'!E42","v":0}]
[]
[null,"Controlling Principal Entity Name:",null,{"$f":"+'Project Description'!E45","v":0}]
[null,"Controlling Principal Role:",null,{"$f":"+'Project Description'!E46","v":0}]
[]
[null,"Contact Person:",null,{"$f":"+'Project Description'!E39","v":0}]
[null,"Email:",null,{"$f":"+'Project Description'!E41","v":0}]
[null,"Telephone:",null,{"$f":"+'Project Description'!E40","v":0}]
[]
[null,"Controlling Principal % Ownership",null,0]
[]
[null,{"$f":"\"I.  PREVIOUS PARTICIPATION OF \"&'Project Description'!E46","v":"I.  PREVIOUS PARTICIPATION OF "}]
[]
[null,{"$f":"\"List all projects in which the \"&D15&J25","v":"List all projects in which the 0 has requested an allocation of low-income housing tax credits or sold a project which received an allocation of low income housing tax credits.  Attach a separate sheet with additional information if necessary."},null,null,null,null,null,null,null," has requested an allocation of low-income housing tax credits or sold a project which received an allocation of low income housing tax credits.  Attach a separate sheet with additional information if necessary."]
[]
[null,null,null,null,null,null,"Application"]
[null,null,"Project Name and Location",null,null,null,"Date","Status"]
[]
[null,null,null,null,null,null,null,"Missing"]
[]
[null,null,null,null,null,null,null,"Missing"]
[]
[null,null,null,null,null,null,null,"Missing"]
[]
[null," II.  DISCLOSURE OF IDENTITIES OF INTEREST RELATED PARTIES:"]
[]
[null,{"$f":"+J38","v":"The undersigned duly authorized representative of the Developer/Taxpayer hereby certifies under penalty of perjury that the following persons are (i) members of the Corporation's Board of Commissioners or Corporation Staff who are related to or have any identity of interest with the Developer/Taxpayer or (ii) affiliates, employees, consultants or otherwise related to or having an identity of interest with the Developer/Taxpayer and who have applied for an Allocation of Tax Credits in the calendar year within which this Application has been submitted or who have any interests in any project receiving Tax Credits and/or projects subject to compliance monitoring by the Corporation."},null,null,null,null,null,null,null,"The undersigned duly authorized representative of the Developer/Taxpayer hereby certifies under penalty of perjury that the following persons are (i) members of the Corporation's Board of Commissioners or Corporation Staff who are related to or have any identity of interest with the Developer/Taxpayer or (ii) affiliates, employees, consultants or otherwise related to or having an identity of interest with the Developer/Taxpayer and who have applied for an Allocation of Tax Credits in the calendar year within which this Application has been submitted or who have any interests in any project receiving Tax Credits and/or projects subject to compliance monitoring by the Corporation."]
[]
[null,"Related Board Members and Staff:"]
[]
[null,"(1)"]
[null,"(2)"]
[null,"(3)"]
[null,"(4)"]
[null,"(5)"]
[]
[null,"Related Affiliates, Employees, Consultants, Etc.:"]
[]
[null,"(1)"]
[null,"(2)"]
[null,"(3)"]
[null,"(4)"]
[null,"(5)"]
[]
[null,{"$f":"+J56&'Project Description'!E46&L56","v":"The undersigned duly authorized representative of the owner (the \"Taxpayer\") of the captioned project (the \"Project\") hereby certifies under penalty of perjury that the Contractor certifying the construction and/or rehabilitation requirements for the Project as well as the cost estimates for the Project bears a relationship either to the Taxpayer or the  within the meaning of Section 267(b) orSection 707(b)(1) of the Internal Revenue Code of 1986, as amended, after substituting 5% for 50% in Section 267(b) and Section 707(b)(1) and does not have any identity of interest with any member of the Board, staff, consultant or other affiliate of the Corporation."},null,null,null,null,null,null,null,"The undersigned duly authorized representative of the owner (the \"Taxpayer\") of the captioned project (the \"Project\") hereby certifies under penalty of perjury that the Contractor certifying the construction and/or rehabilitation requirements for the Project as well as the cost estimates for the Project bears a relationship either to the Taxpayer or the ",null," within the meaning of Section 267(b) orSection 707(b)(1) of the Internal Revenue Code of 1986, as amended, after substituting 5% for 50% in Section 267(b) and Section 707(b)(1) and does not have any identity of interest with any member of the Board, staff, consultant or other affiliate of the Corporation."]
[]
[null,{"$f":"\"WITNESS my signature on \"&TEXT(D73,\"mmmm d yyyy\")","v":"WITNESS my signature on January 0 1900"}]
[]
[null,null,{"$f":"\"Builder \"&IF('Project Description'!H64=\"Yes\",\"IS\",\"IS NOT\")&\" related to Taxpayer or \"&D15","v":"Builder IS NOT related to Taxpayer or 0"}]
[]
[null,null,null,null,null,{"$f":"+'App 1 Owner Info'!D10&\" (Taxpayer)\"","v":"0 (Taxpayer)"}]
[]
[]
[null,null,null,null,"By:"]
[null,{"$f":"J66&TEXT(D74,\"mmmm d yyyy\")","v":"Sworn to and subscribed before me January 0 1900"},null,null,null," ",null,null,null,"Sworn to and subscribed before me "]
[]
[null,null,null,null,null,null,null,null,null,"Builder IS related to Taxpayer or General Partner"]
[null,null,null,null,null,null,null,null,null,"Builder IS NOT related to Taxpayer or General Partner"]
[null,{"$f":"\"Notary Public, State of \"&D75","v":"Notary Public, State of "}]
[]
[]
[null,"Date of Taxpayer Certification:"]
[null,"Date of Notarization:"]
[null,"State for Notary Public:"]

{"sheet":"App 2 Site Control","index":23,"n_rows":67,"n_cols":15,"rows_kept":67,"cut":false,"hidden":false,"merged":[[3,0,3,11],[61,5,61,6],[62,5,62,6],[63,5,63,6],[64,5,64,6],[10,4,10,9],[49,2,49,10],[20,2,20,10],[36,2,36,10],[22,2,22,10],[38,2,38,10],[25,3,25,10],[27,2,27,10],[51,2,51,10]]}
[]
[]
[{"$f":"+Instructions!A3","v":"2025 QAP Underwriting Application v1.1"}]
[{"$f":"TRIM('Project Description'!E84)&\" (\"&TRIM('Project Description'!E86)&\" LA), \"&'Project Description'!E50","v":" ( LA), "}]
[]
["Site Control Worksheet"]
[]
[null,"I. ","Applicant must have control of the site and existing building(s) if any."]
[]
[null,null,"A. ","Please indicate the method of site control:"]
[null,null,null,null,"Missing"]
[]
[null,null,"B. ","Purchase Information",null,null,null,null,null,null,null,null,null,{"$f":"SUM(N14:N17)","v":0},"Total Acquisition Cost"]
[null,null,null,null,"Total Purchase Price:",null,null," (regardless of when paid)",null,null,null,null,null,{"$f":"+'Development Costs'!C13","v":0},{"$f":"+'Development Costs'!B13","v":"Building Acquisition"}]
[null,null,null,null,"Paid to Date:",null,null," (amount paid at time of application)",null,null,null,null,null,{"$f":"+'Development Costs'!C14","v":0},{"$f":"+'Development Costs'!B14","v":"Land Acquisition (value of donated land)"}]
[null,null,null,null,"Outstanding Balance:",null,{"$f":"+G14-G15","v":0}," (calculated)",null,null,null,null,null,{"$f":"+'Development Costs'!C15","v":0},{"$f":"+'Development Costs'!B15","v":"Land Acquisition (other)"}]
[]
[null,null,null,null,"Site Area:",null,null,"Square Feet"]
[null,null,null,null,"Purchase Price / S.F.:",null,{"$f":"IF(G18<>0, G14/G18, 0)","v":0}]
[null,null,null,null,"Date of Purchase:"]
[null,null,{"$f":"IF(OR(N13=0,G14=0,ROUND(G14,0)=ROUND(N13,0)),\"\",\"Purchase price does not agree with Total Acquisition Cost. Please explain.\")","v":""}]
[]
[null,null,"Comment for purchase price"]
[]
[null,null,"C. ","Option Information"]
[null,null,null,"Explain the purchase option: when was the option purchased, how much was paid for the option, when does the option expire, are there any provisions for extension of the option?"]
[]
[null,null,"Explanation of option to purchase"]
[]
[null,null,null,null,"Total Purchase Price:",null,null," (including the cost of the option)"]
[null,null,null,null,"Paid to Date:",null,null," (amount paid at time of application)"]
[null,null,null,null,"Outstanding Balance:",null,{"$f":"+G30+G31","v":0}," (calculated)"]
[]
[null,null,null,null,"Site Area:",null,null,"Square Feet"]
[null,null,null,null,"Purchase Price / S.F.:",null,{"$f":"IF(G34<>0, G30/G34, 0)","v":0}]
[]
[null,null,{"$f":"IF(OR(G30=0,N13=0,ROUND(N13,0)=ROUND(G30,0)),\"\",\"Option price does not agree with Total Acquisition Cost. Please explain.\")","v":""}]
[]
[null,null,"Additional comment"]
[]
[null,null,"D. ","Lease Information"]
[null,null,null,null,"Amount Paid for Leasehold Interest:"]
[null,null,null,null,"Annual Ground Rent:",null,null,null,null,"*"]
[null,null,null,null,"Lease Term:",null,null,null,null,"years"]
[null,null,null,null,"Remaining Years:",null,null,null,null,"years"]
[null,null,null,null,"Site Area:",null,null,null,null,"Square Feet"]
[null,null,null,null,"Cost/S.F.:",null,null,null,{"$f":"IF(I46<>0, (I42+(I43*I45))/I46, 0)","v":0}]
[null,null,null,null,"Date of Lease:",null,null,null,"00:00:00"]
[]
[null,"*","Annual Ground Rent must be included as a Miscellaneous Tax & Insurance Expense (on the Revenues and Expenses worksheet), or prepaid Annual Ground Rent must be included as an Other Soft Cost (on the Development Costs worksheet)."]
[]
[null,null,"Comment for ground lease"]
[]
[null,null,"E. ","Attached to and made a part hereof are copies of the site control documents."]
[]
[null,"II. ","Complete this section if applicant does not have control of the site and existing building(s) if any."]
[]
[null,null,"A. ","What is the estimated Purchase Price for the site?"]
[]
[null,null,"B. ","Provide the following information about the current legal owner:"]
[]
[null,null,null,null,"Name"]
[null,null,null,null,"Address"]
[null,null,null,null,"City",null,null,"State",null,"Zip"]
[null,null,null,null,"Telephone"]
[]
[null,"III. ","Attached to and made a part hereof is a legal description of each parcel of land."]

{"sheet":"App 3 Ownership History","index":24,"n_rows":42,"n_cols":9,"rows_kept":42,"cut":false,"hidden":false,"merged":[[3,0,3,4],[21,1,21,2],[30,1,30,2],[39,1,39,2],[7,1,7,4],[9,1,9,2],[11,1,11,4]]}
[]
[]
[{"$f":"+Instructions!A3","v":"2025 QAP Underwriting Application v1.1"}]
[{"$f":"TRIM('Project Description'!E84)&\" (\"&TRIM('Project Description'!E86)&\" LA), \"&'Project Description'!E50","v":" ( LA), "}]
[]
["Ownership History of Existing Buildings"]
[]
[null,"This worksheet must be completed if Taxpayer is requesting credits for the purchase price of an existing building."]
[]
["I. ","Specify the date on which building was acquired by purchase as defined in Section 179(d)(2) of the Internal Revenue Code of 1986, as amended (the \"Code\") (substitute 10% for 50% in Sections '267(b) and 179(b)(n)):",null,null,"00:00:00"]
[]
["II. ","Specify all previous owners of and the purchase price with respect to the building from the January which is ten years prior to the calendar year in which Taxpayer is seeking an award of tax credits to the date the building was or will be acquired by Taxpayer:"]
[]
[null,null,"Owners",null,"Purchase Price"]
[]
[]
[]
[]
[]
[]
[]
["III. ","Do any of the previous owners bear a relationship to the Taxpayer specified in Section 267(b) or Section 707(b)(1)?",null,null,"Missing"]
[]
[null,null,"If Yes, specify which of the previous owners are such related persons:"]
[]
[null,null,"x"]
[null,null,"x"]
[null,null,"x"]
[null,null,"x"]
[]
["IV. ","Are any of the previous owners and the Taxpayer under common control (within the meaning of subsections (a) and (b) of Section 52 of the Code)?",null,null,"Missing"]
[]
[null,null,"If Yes, specify which of the previous owners are such related persons:"]
[]
[null,null,"x"]
[null,null,"x"]
[null,null,"x"]
[null,null,"x"]
[]
["V. ","Is this a Distressed Property (as defined in the QAP)?",null,null,{"$f":"+H40","v":"Missing"},null,null,{"$f":"+'Project Description'!H141","v":"Missing"},"From Project Description worksheet: is this a 'Distressed Property'?"]
[]
[null,"If yes, attach written certification from HUD or RD that property is distressed."]

{"sheet":"App 4 Zoning","index":25,"n_rows":35,"n_cols":4,"rows_kept":35,"cut":false,"hidden":false,"merged":[[3,0,3,3]]}
[]
[]
[{"$f":"+Instructions!A3","v":"2025 QAP Underwriting Application v1.1"}]
[{"$f":"TRIM('Project Description'!E84)&\" (\"&TRIM('Project Description'!E86)&\" LA), \"&'Project Description'!E50","v":" ( LA), "}]
[]
["Zoning Certification"]
[]
[]
[null,"Attn: Tax Credit/HOME Manager"]
[null,"Louisiana Housing Corporation"]
[null,"2415 Quail Drive"]
[null,"Baton Rouge, Louisiana 70808"]
[]
[null,"Subject:","Project Name Here"]
[null,null,"City and State Here"]
[]
[]
[null,"This letter certifies the following:"]
[]
[null,null,null,"the property is properly zoned for the proposed project."]
[]
[null,null,null,"the developer has submitted a request to zone site for multi-family use and the authority does not foresee or anticipate any negative problems with respect to zoning."]
[]
[null,null,null,"the property is not properly zoned for the proposed project."]
[]
[null,null,null,"the property has not been zoned by this authority and no request has been made."]
[]
[]
[null,"Sincerely,"]
[]
[]
[null,"By:","  "]
[null,"Name:"]
[null,"Title:"]
[null,"Date:"]

{"sheet":"App 11 NP Participation","index":26,"n_rows":42,"n_cols":8,"rows_kept":42,"cut":false,"hidden":false,"merged":[[3,0,3,8],[10,1,10,7],[11,1,11,7],[13,1,13,7],[28,1,28,7],[15,1,15,7],[16,1,16,7],[19,1,19,5],[23,1,23,7],[27,1,27,7]]}
[]
[]
[{"$f":"+Instructions!A3","v":"2025 QAP Underwriting Application v1.1"}]
[{"$f":"TRIM('Project Description'!E84)&\" (\"&TRIM('Project Description'!E86)&\" LA), \"&'Project Description'!E50","v":" ( LA), "}]
[]
["Non-Profit Participation Information"]
[]
[null,"Date the non-profit was created:",null,null,null,null,null,"00:00:00"]
[]
[null,"Name of the non-profit:"]
[]
[]
[null,"Describe the non-profit's participation in the development and operation of the project."]
[]
[]
[null,"List the names and addresses of Board Members for the non-profit organization. Identify all paid, full time staff and sources of funds for annual operating expenses and current programs."]
[]
[]
[]
[null,"Specify the Non-profit's Ownership interest in the project or the partnership owning the project:",null,null,null,null,null,0]
[]
[null,"Is Non-profit \"Local\"?*",null,null,null,null,null,"Missing"]
[null,"Is Non-profit a CHDO?",null,null,null,null,null,"Missing"]
[null,"* If Applicant requested points based on non-profit being \"Local,\" not more than fifteen percent (15%) of Board Members may reside outside of the service area of the non-profit and at least 75% of Board Members must reside within Market Area of the Project."]
[]
[null,"Is Non-profit a 501(c)(3) or 501(c)(4) organization?",null,null,null,null,null,"Missing"]
[]
[null,"Describe the charitable activities of Non-profit over the last three calendar years and how such activities are consistent with services to be provided in connection with the Project."]
[]
[]
[null,"Attach resume of the non-profit employee who has affordable housing development experience."]
[]
[null,"Identify affordable housing developments owned by Non-profit."]
[null,"Name",null,"Location",null,"Number of Units",null,"Subsidized?"]
[]
[null,null,null,null,null,null,null,"Missing"]
[]
[null,null,null,null,null,null,null,"Missing"]
[]
[null,null,null,null,null,null,null,"Missing"]
[]
[null,null,null,null,null,null,null,"Missing"]

{"sheet":"App 13 NP Counsel Opinion","index":27,"n_rows":45,"n_cols":2,"rows_kept":45,"cut":false,"hidden":false,"merged":[[33,0,33,1],[39,0,39,1],[21,0,21,1],[23,0,23,1],[3,0,3,1]]}
[]
[]
[{"$f":"+Instructions!A3","v":"2025 QAP Underwriting Application v1.1"}]
[{"$f":"TRIM('Project Description'!E84)&\" (\"&TRIM('Project Description'!E86)&\" LA), \"&'Project Description'!E50","v":" ( LA), "}]
[]
["Format for Counsel's Opinion of Non-Profit Qualification"]
[]
["(Must be submitted with initial application)"]
["(Submitted on attorney's letterhead)"]
[]
["Louisiana Housing Corporation"]
["2415 Quail Drive"]
["Baton Rouge, Louisiana 70808"]
["Attn: Tax Credit Coordinator"]
[]
[null,"Project Name Here"]
[null,"City and State Here"]
[null,"Eligibility for Non-Profit Set-Aside"]
[]
["Ladies and Gentlemen:"]
[]
["You have asked that we render our opinion that (non-profit) is a qualified nonprofit organization within the meaning of Section 469(h) of the Internal Revenue Code.  We understand that you require this opinion as a prerequisite to your consideration of making an allocation of Low-Income Housing Tax Credits with respect to the Project from the set-aside reserved for the use of qualified non-profit organizations."]
[]
["In rendering the following opinion, we reviewed the Articles of Incorporation, Charter and Bylaws of (non-profit); the Letter of Determination dated (date) from the Internal Revenue Service with respect to (non-profit); and all records of (non-profit) and other potential participants in the Project sufficient to make a determination as to the relationship of (non-profit) with any other potential participants in the Project.  Based on our review of the foregoing, it is our opinion that: "]
[]
["1.","(Non-profit) is a 501(c)(3) or 501(c)(4) organization and is exempt from tax under Section 501(a)."]
[]
["2.","One of the exempt purposes of (non-profit) includes the fostering of low-income housing."]
[]
["3.","Individuals or entities involved with or related to any potential for-profit participant in the Project are not involved with or related to the creation or management of (non-profit)."]
[]
["4.","(Non-profit) is not affiliated with or controlled by a for-profit organization."]
[]
["In rendering the following opinion, we examined certificates containing representations made to us by (non-profit) and each potential participant in the Project, copies of which are attached hereto and incorporated herein by this reference.  Based on our review of the attached certificates, it is our opinion that:"]
[]
["1.","(Non-profit) and all potential participants intend that (non-profit) will own an interest in the Project either directly or through a partnership (which partnership has yet been formed)."]
[]
["2.","(Non-profit) and all potential participants intend that (non-profit) will materially participate (within the meaning of Section 469(h)) in the Project and operation of the Project throughout the compliance period."]
[]
["It is our intention that this opinion be relied upon by you in making your determination as to the eligibility of the Project to receive Low-Income Housing Tax Credits from the Non-profit Set-Aside."]
[]
["Sincerely,"]
[]
[]
["/s/"]

{"sheet":"App 34 Debarment","index":28,"n_rows":35,"n_cols":6,"rows_kept":35,"cut":false,"hidden":false,"merged":[[16,5,16,11],[30,5,30,11],[32,5,32,11],[26,5,26,11],[18,5,18,11],[20,5,20,11],[22,5,22,11],[24,5,24,11],[28,5,28,11],[3,0,3,3],[5,0,5,1],[10,5,10,11],[12,5,12,11],[14,5,14,11]]}
[]
[]
[{"$f":"+Instructions!A3","v":"2025 QAP Underwriting Application v1.1"}]
[{"$f":"TRIM('Project Description'!E84)&\" (\"&TRIM('Project Description'!E86)&\" LA), \"&'Project Description'!E50","v":" ( LA), "}]
[]
["Certification Regarding Debarment, Suspension, Ineligibility and Voluntary Exclusion (Lower Tier Covered Transactions)"]
[null,"Instructions for Certification"]
[]
[1,"By signing and submitting this proposal, the applicant is providing the certification set out below."]
[]
[2,{"$f":"+F11","v":"The certification in this clause is a material representation of fact upon which reliance was placed when this transaction was entered into.  If it is later determined that the applicant knowingly rendered an erroneous certification, in addition to other remedies available to the Federal Government, the department or Corporation with which this transaction originated may pursue available remedies, including suspension and/or debarment."},null,null,null,"The certification in this clause is a material representation of fact upon which reliance was placed when this transaction was entered into.  If it is later determined that the applicant knowingly rendered an erroneous certification, in addition to other remedies available to the Federal Government, the department or Corporation with which this transaction originated may pursue available remedies, including suspension and/or debarment."]
[]
[3,{"$f":"+F13","v":"The applicant shall provide immediate written notice to the person to which this proposal is submitted if at any time the applicant learns that its certification was erroneous when submitted or has become erroneous by reason of changed circumstances."},null,null,null,"The applicant shall provide immediate written notice to the person to which this proposal is submitted if at any time the applicant learns that its certification was erroneous when submitted or has become erroneous by reason of changed circumstances."]
[]
[4,{"$f":"+F15","v":"The terms \"covered transaction,\" \"debarred\", \"suspended,\" \"ineligible,\" \"lower tier covered transaction,\" \"participant,\" \"person,\" \"primary covered transaction,\" \"principal,\" \"proposal,\" and \"voluntarily excluded,\" as used in this clause, have the meanings set out in the Definitions and Coverage sections of rules implementing Executive Order 12549.  Contact the Corporation for assistance in obtaining a copy of those regulations."},null,null,null,"The terms \"covered transaction,\" \"debarred\", \"suspended,\" \"ineligible,\" \"lower tier covered transaction,\" \"participant,\" \"person,\" \"primary covered transaction,\" \"principal,\" \"proposal,\" and \"voluntarily excluded,\" as used in this clause, have the meanings set out in the Definitions and Coverage sections of rules implementing Executive Order 12549.  Contact the Corporation for assistance in obtaining a copy of those regulations."]
[]
[5,{"$f":"+F17","v":"The applicant agrees by submitting this proposal that, should the proposed covered transaction be entered into, it shall not knowingly enter into any lower tier covered transaction with a person who is debarred, suspended, declared ineligible, or voluntarily excluded from participation in this covered transaction, unless authorized by the Corporation."},null,null,null,"The applicant agrees by submitting this proposal that, should the proposed covered transaction be entered into, it shall not knowingly enter into any lower tier covered transaction with a person who is debarred, suspended, declared ineligible, or voluntarily excluded from participation in this covered transaction, unless authorized by the Corporation."]
[]
[6,{"$f":"+F19","v":"The applicant further agrees by submitting this proposal that it will include this clause titled \"Certification Regarding Debarment, Suspension, Ineligibility and Voluntary Exclusion - Lower Tier Covered Transaction,\" without modification, in all lower tier covered transactions and in all solicitations for lower tier covered transactions."},null,null,null,"The applicant further agrees by submitting this proposal that it will include this clause titled \"Certification Regarding Debarment, Suspension, Ineligibility and Voluntary Exclusion - Lower Tier Covered Transaction,\" without modification, in all lower tier covered transactions and in all solicitations for lower tier covered transactions."]
[]
[7,{"$f":"+F21","v":"A participant in a covered transaction may rely upon a certification of a prospective participant in a lower tier covered transaction that is not debarred, suspended, ineligible, or voluntarily excluded from the covered transaction, unless it knows that the certification is erroneous.  A participant may decide the method and frequency by which it determines the eligibility of its principals.  Each participant may, but is not required to, check the Nonprocurement List."},null,null,null,"A participant in a covered transaction may rely upon a certification of a prospective participant in a lower tier covered transaction that is not debarred, suspended, ineligible, or voluntarily excluded from the covered transaction, unless it knows that the certification is erroneous.  A participant may decide the method and frequency by which it determines the eligibility of its principals.  Each participant may, but is not required to, check the Nonprocurement List."]
[]
[8,{"$f":"+F23","v":"Nothing contained in the foregoing shall be construed to require establishment of a system of records in order to render in good faith the certification required by this clause.  The knowledge and information of a participant is not required to exceed that which is normally possessed by a prudent person in the ordinary course of business dealings."},null,null,null,"Nothing contained in the foregoing shall be construed to require establishment of a system of records in order to render in good faith the certification required by this clause.  The knowledge and information of a participant is not required to exceed that which is normally possessed by a prudent person in the ordinary course of business dealings."]
[]
[9,{"$f":"+F25","v":"Except for transactions authorized under paragraph 5 of these instruction, if a participant in a covered transaction knowingly enters into a lower tier covered transaction with a person who is suspended, debarred, ineligible, or voluntarily excluded from participation in this transaction, in addition to other remedies available to the Federal Government, the department or Corporation with which this transaction originated may pursue available remedies, including suspension and/or debarment."},null,null,null,"Except for transactions authorized under paragraph 5 of these instruction, if a participant in a covered transaction knowingly enters into a lower tier covered transaction with a person who is suspended, debarred, ineligible, or voluntarily excluded from participation in this transaction, in addition to other remedies available to the Federal Government, the department or Corporation with which this transaction originated may pursue available remedies, including suspension and/or debarment."]
[]
[null,{"$f":"+F27","v":"Certification regarding Debarment, Suspension, Ineligibility and Voluntary Exclusion - Lower Tier  Covered Transactions."},null,null,null,"Certification regarding Debarment, Suspension, Ineligibility and Voluntary Exclusion - Lower Tier  Covered Transactions."]
[]
["(1)",{"$f":"+F29","v":"The applicant certifies, by submission of this proposal that neither it nor its principals is presently debarred, suspended, proposed for debarment, declared ineligible, or voluntarily excluded from participation in this transaction by any Federal department or Corporation."},null,null,null,"The applicant certifies, by submission of this proposal that neither it nor its principals is presently debarred, suspended, proposed for debarment, declared ineligible, or voluntarily excluded from participation in this transaction by any Federal department or Corporation."]
[]
["(2)",{"$f":"+F31","v":"The applicant certifies herein that no taxpayer, its representative or agent, managing general partner, sponsor or management company included in the application has been deemed by the Corporation as being “not in good standing”. One is considered to be “not in good standing” with the Corporation if one has met one or more of the criteria listed in Section II (F) (3) Project Team Disqualification  of the QAP.\n\n"},null,null,null,"The applicant certifies herein that no taxpayer, its representative or agent, managing general partner, sponsor or management company included in the application has been deemed by the Corporation as being “not in good standing”. One is considered to be “not in good standing” with the Corporation if one has met one or more of the criteria listed in Section II (F) (3) Project Team Disqualification  of the QAP.\n\n"]
[]
["(3)",{"$f":"+F33","v":"Where the applicant is unable to certify to any of the statements in this certification, such prospective participant shall attach an explanation to this proposal."},null,null,null,"Where the applicant is unable to certify to any of the statements in this certification, such prospective participant shall attach an explanation to this proposal."]
[]
[null,"Signature :  _______________________________________________________________"]

{"sheet":"App 35 Matching","index":29,"n_rows":23,"n_cols":5,"rows_kept":23,"cut":false,"hidden":false,"merged":[[7,0,7,4],[3,0,3,4]]}
[]
[]
[{"$f":"+Instructions!A3","v":"2025 QAP Underwriting Application v1.1"}]
[{"$f":"TRIM('Project Description'!E84)&\" (\"&TRIM('Project Description'!E86)&\" LA), \"&'Project Description'!E50","v":" ( LA), "}]
[]
["Matching Certification"]
[]
["The Applicant hereby certifies that the following amounts have been or will be made available to complete the Project and/or to assure that the housing units assisted with HOME Funds are affordable:  (Full documentation evidencing commitment must be attached.)"]
[]
[1,null,"Non-federal cash from local governmental unit"]
[]
[2,null,"Abatement of state or local taxes, fees or other charges which otherwise would have been imposed"]
[]
[3,null,"Value of land or other real property (less any debt burden, lien or other encumbrance) not acquired with federal resources"]
[]
[4,null,"Investments within prior 10 months from non-federal resources in on-site and off-site infrastructure directly required for affordable housing assistance with HOME Funds."]
[]
[5,null,"Reasonable value of any site preparation and construction materials not acquired with federal resources and any donated or voluntary laborin connection with the site preparation for or construction or rehabilitation of affordable housing."]
[]
[null,null,"TOTAL",null,{"$f":"SUM(E9:E19)","v":0}]
[]
[]
["By:",null,"_______________________________________________________                 Date: __________________"]

{"sheet":"App 36 Environmental","index":30,"n_rows":107,"n_cols":7,"rows_kept":107,"cut":false,"hidden":false,"merged":[[44,1,44,3],[22,1,22,6],[26,1,26,3],[28,1,28,3],[32,1,32,3],[34,1,34,3],[36,1,36,3],[38,1,38,3],[40,1,40,3],[42,1,42,3],[30,2,30,6],[69,1,69,3],[46,1,46,3],[48,1,48,3],[50,1,50,3],[52,1,52,3],[54,1,54,3],[56,1,56,3],[58,1,58,6],[63,1,63,3],[65,1,65,3],[67,1,67,3],[59,1,59,6],[81,1,81,3],[83,1,83,3],[85,1,85,3],[87,1,87,3],[89,1,89,3],[71,1,71,3],[73,1,73,3],[75,1,75,3],[77,1,77,3],[79,1,79,3],[101,1,101,3],[103,1,103,6],[106,1,106,6],[107,1,107,6],[91,1,91,3],[104,1,104,6],[93,1,93,3],[95,1,95,3],[97,1,97,3],[99,1,99,3],[19,2,19,6],[7,2,7,6],[9,2,9,6],[10,2,10,6],[11,2,11,6],[12,2,12,6],[3,0,3,6],[14,2,14,6],[16,2,16,6],[17,2,17,6],[18,2,18,6]]}
[]
[]
[{"$f":"+Instructions!A3","v":"2025 QAP Underwriting Application v1.1"}]
[{"$f":"TRIM('Project Description'!E84)&\" (\"&TRIM('Project Description'!E86)&\" LA), \"&'Project Description'!E50","v":" ( LA), "}]
[]
["Environmental Restrictions Checklist"]
[]
[null,"Project Name:"]
[]
[null,"Street Address:"]
[null,"City:"]
[null,"Parish"]
[null,"Zip Code:"]
[]
[null,"Owner Name:"]
[]
[null,"Street Address:"]
[null,"City:"]
[null,"Parish"]
[null,"Zip Code:"]
[]
[null,"Project Description:"]
[]
[]
[null,"Environmental Review Findings"]
[]
[null,"FLOOD PLAIN",null,null,"YES",null,"NO"]
[]
[null,"Is the project located in a FEMA Special Flood Hazard Area? (Current flood plain maps should be found in a each HUD field office or call FEMA at 1-800-358-9619, and FEMA's website URL is www.fema.gov/mit/tsd)",null,null," ",null," "]
[]
[null,"Identify Map Panel and Date"]
[]
[null,"Does the project currently carry Flood Insurance?",null,null," ",null," "]
[]
[null,"Do any structures appear to be within or close to the floodplain? (If yes, then flood insurance is required.)",null,null," ",null," "]
[]
[null,"HISTORIC PRESERVATION (If yes, identify relevant restrictions below.)",null,null,"YES",null,"NO"]
[]
[null,"Is the property listed in the National Register of Historic Places?",null,null," ",null," "]
[]
[null,"Is the property located in a historic district listed in the National Register of Historic Places?",null,null," ",null," "]
[]
[null,"Is the property located in a historic district determined to be eligible for the National Register?",null,null," ",null," "]
[]
[null,"AIRPORT HAZARDS",null,null,"YES",null,"NO"]
[]
[null,"Is the project located in the clear zone of an airport? (24 CFR Part 51 D.  If yes, Notice is required.)",null,null," ",null," "]
[]
[null,"HAZARDOUS OPERATIONS",null,null,"YES",null,"NO"]
[]
[null,"Is there any evidence or indication of manufacturing operations utilizing or producing hazardous substances (paints, solvents, acides, bases, flammable materials, compressed gases, poisons, or other chemical materials) at or in close proximity to the site",null,null," ",null," "]
[]
[null,"Is there any evidence or indication that past operations located in or in close proximity to the property used hazardous substances or radiological materials that may have been released into the environment?",null,null," ",null," "]
[]
[null,"EXPLOSIVE/FLAMMABLE OPERATIONS/STORAGE (24 CFR Part 51C)",null,null,"YES",null,"NO"]
[]
[null,"Is there visual evidence or indicators of unobstructed or unshielded above ground storage tanks (fuel oil, gasoline, propane, etc.) or operations utilizing explosive/flammable material at or in close proximity to the property?",null,null," ",null," "]
[]
[null,"FOR YES RESPONSES, SUMMARIZE RESTRICTIONS BELOW:"]
[null,"x"]
[]
[null,"Environmental Review Findings"]
[]
[null,"TOXIC CHEMICAL AND RADIOACTIVE MATERIALS",null,null,"YES",null,"NO"]
[]
[null,"Petroleum Storage"]
[]
[null,"Is there any evidence or indication of the presence of commerical or residential heating activities that suggest that underground storage tanks may be located in the property?",null,null," ",null," "]
[]
[null,"If yes, are any such tanks being used? If yes, indicate below whether the tank is registered, when it was last tested for leaks, the results of that test, and whether there are any applicable state or local laws that impose additional requirements beyond those required under federal law.",null,null," ",null," "]
[]
[null,"Are there any out-of-service underground fuel storage tanks? If yes, indicate whether the tank was closed out in accordance with applicable state, local and federal laws.",null,null," ",null," "]
[]
[null,"Polychlorinated Biphenyls (PCB)",null,null,"YES",null,"NO"]
[]
[null,"Is there any evidence or indication that electrical equipment, such as transformers, capacitors, or hydraulic equipment (found in machinery and elevators, installed prior to July 1, 1884) are present on the site?",null,null," ",null," "]
[]
[null,"If yes, is any such equipment (a) owned by anyone other than a public utility company; and (b) not marked with a \"PCB Free\" sticker?",null,null," ",null," "]
[]
[null,"If yes, indicate below whether such equipment has been tested for PCBs, the results of those tests, and (if no testing has been performed) the proposed testing approach. (Electrical equipment need not be tested but will be assumed to have PCBs)",null,null," ",null," "]
[]
[null,"If PCBs are found in non-electrical equipment over 50 ppm it must be replaced or retrofitted, otherwise any equipment with PCBs or assumed to have PCBs requires an O&M Plan."]
[]
[null,"Asbestos Containing Materials (ACM)",null,null,"YES",null,"NO"]
[]
[null,"Is there any evidence or indication of ACM insulation or fire retardant materials such as boiler or pipe wrap, ceiling spray, etc., within the buildings on the property? If yes, the property is required to have an Operations and Maintenance Plan for asbestos containing materials.",null,null," ",null," "]
[]
[null,"Lead Based Paint",null,null,"YES",null,"NO"]
[]
[null,"Are there residential structures on the property that were built prior to 1978?",null,null," ",null," "]
[]
[null,"If yes, has the property been certified as lead-free?",null,null," ",null," "]
[]
[null,"If property has not been certified as lead-free, has a Risk Assessment been completed?",null,null," ",null," "]
[]
[null,"If yes, has the owner developed a plan including Interim Controls to address the findings of the Risk Assessment including Tenant notifications and an Operations and Maintenance Plan?",null,null," ",null," "]
[]
[null,"If yes, has a qualified Risk Assessor reviewed the Owner's plan and O&M plan for compliance with 24 CFR 35?",null,null," ",null," "]
[]
[null,"EASEMENT AND USE RESTRICTIONS",null,null,"YES",null,"NO"]
[]
[null,"Are there easements, deed restrictions or other use restrictions on this property? (e.g. oil and gas well pumping, transformer boxes, units, navigation, microwave, rights of way (ROW), for high-voltage power transmission lines, interstate/intrastate gas and liquid petroleum pipelines, etc.)",null,null," ",null," "]
[]
[null,"FOR YES RESPONSES, SUMMARIZE RESTRICTIONS BELOW"]
[]
[]
[null,"Indicate the name and title of the person who completed this checklist."]

{"sheet":"LHC-2 CEO Notification","index":31,"n_rows":59,"n_cols":2,"rows_kept":59,"cut":false,"hidden":false,"merged":[[9,0,9,1],[26,0,26,1],[43,0,43,1],[3,0,3,2]]}
[]
[]
[{"$f":"+Instructions!A3","v":"2025 QAP Underwriting Application v1.1"}]
[{"$f":"TRIM('Project Description'!E84)&\" (\"&TRIM('Project Description'!E86)&\" LA), \"&'Project Description'!E50","v":" ( LA), "}]
[]
["LHC-2: Information for State and Local Government Notification Letters"]
[]
["Please provide the following information for each of the jurisdictions the project falls within (Local, Parish, and State Representative)"]
[]
["CEO Notification Letter Information (Local)"]
[]
["Project Name:",{"$f":"+'Project Description'!E84","v":0}]
[]
["Name of local Chief Executive Officer (CEO):"]
[]
["Job Title:"]
[]
["Municipality/Locality:"]
[]
["Street Address:"]
[]
[]
["City, State, Zip:"]
[]
["Salutation:"]
[]
["CEO Notification Letter Information (Parish)"]
[]
["Project Name:",{"$f":"+B12","v":0}]
[]
["Name of Parish Chief Executive Officer (CEO):"]
[]
["Job Title:"]
[]
["Municipality/Locality:"]
[]
["Street Address:"]
[]
[]
["City, State, Zip:"]
[0]
["Salutation:"]
[]
["CEO Notification Letter Information (State Representative)"]
[]
["Project Name:",{"$f":"+B29","v":0}]
[]
["Name of State Representative:"]
[]
["Job Title:"]
[]
["Municipality/Locality:"]
[]
["Street Address:"]
[]
[]
["City, State, Zip:"]
[]
["Salutation:"]

{"sheet":"LHC-3 Developer Experience","index":32,"n_rows":54,"n_cols":8,"rows_kept":54,"cut":false,"hidden":false,"merged":[[7,0,8,7],[48,0,49,7],[51,0,51,3],[55,1,55,3],[106,2,106,3],[53,0,53,3],[52,0,52,3],[42,0,42,1],[40,0,40,2]]}
[]
[]
[{"$f":"+Instructions!A3","v":"2025 QAP Underwriting Application v1.1"}]
[{"$f":"TRIM('Project Description'!E84)&\" (\"&TRIM('Project Description'!E86)&\" LA), \"&'Project Description'!E50","v":" ( LA), "}]
[]
[{"$f":"\"LHC-3: Developer Experience for \"&'Project Description'!E45&\" (\"&TRIM('Project Description'!E46)&\")\"&\" and Affiliates\"","v":"LHC-3: Developer Experience for  () and Affiliates"}]
[]
["Complete the information below for projects your organization has developed, placed in service, and currently owns.  List only those projects whose size or scope meet the requirements stated in the QAP.  Do not include projects approved but not yet placed in service."]
[]
["Project Name","Project Contact","State","Project Type","Low Income Units","Placed in Service Date","Total Development Costs","Funding Source(s) (Name of Agency, Contact Person and Phone Number)"]
[]
[]
[]
[]
[]
[]
[]
[]
[]
[]
[]
[]
[]
[]
[]
[]
[]
[]
[]
[]
[]
[]
[]
[]
[]
[]
[]
[]
[null,null,null,"Total",{"$f":"SUM(E11:E38)","v":0},null,{"$f":"SUM(G11:G38)","v":0}]
[]
["Have you been awarded 8609s on an LHC Housing Credit project?",null,null,"Missing"]
[]
["If yes, please complete the following for one project:"]
[]
[]
["Project Name","Project Number",null,null,null,"Date of 8609"]
[]
[]
["I, the undersigned , certify I have developed and have ownership in the above-listed projects and that the information given is true and correct.  I hereby further acknowledge that in reviewing and considering my application, LHC may request additional if necessary."]
[]
[]
[]
["Signature:",null,null,null,null,"Date:"]
["Name"]

{"sheet":"LHC-4 Management Experience","index":33,"n_rows":60,"n_cols":5,"rows_kept":60,"cut":false,"hidden":false,"merged":[[3,0,3,5],[7,0,8,5],[112,2,112,3],[41,0,41,2],[55,0,55,2],[57,0,57,2],[56,0,56,2],[49,0,49,5],[51,0,52,5],[58,1,58,3],[43,0,43,1]]}
[]
[]
[{"$f":"+Instructions!A3","v":"2025 QAP Underwriting Application v1.1"}]
[{"$f":"TRIM('Project Description'!E84)&\" (\"&TRIM('Project Description'!E86)&\" LA), \"&'Project Description'!E50","v":" ( LA), "}]
[]
[{"$f":"\"LHC-4: Management Experience for \"&'Project Description'!E76","v":"LHC-4: Management Experience for "}]
[]
["Complete the information below for projects your organization has in its current portfolio of similar size and type .  Do not include projects approved but not yet placed in service."]
[]
[]
["Project Name","Project Contact","State","Project Type","Low Income Units"]
[]
[]
[]
[]
[]
[]
[]
[]
[]
[]
[]
[]
[]
[]
[]
[]
[]
[]
[]
[]
[]
[]
[]
[]
[]
[]
[]
[]
[null,null,null,"Total ",{"$f":"SUM(E12:E39)","v":0}]
[]
["Have the person or entities serving as management agent had a project with material or uncorrected non-compliance beyond the cure period?",null,null,"Missing"]
[]
["If yes, please complete the following for one project:"]
[]
[]
["Project Name","Project Number","State","Project Type","Units"]
[]
[]
[{"$f":"\"Certification of \"&'Project Description'!E36&\", Taxpayer/Applicant\"","v":"Certification of , Taxpayer/Applicant"}]
[]
["I, the undersigned , understand the management agent listed on the application must be retained by the ownership entity for at least two years after project completion, unless the Taxpayer releases the agent for nonperformance of duties. "]
[]
[]
[]
[]
["Signature:",null,null,null,"Date:"]
["Name"]
[]
[null,null,"ALABAMA"]

{"sheet":"Existing LHC Property","index":34,"n_rows":32,"n_cols":2,"rows_kept":32,"cut":false,"hidden":false,"merged":[[10,1,23,8],[31,1,31,2],[31,4,31,7],[1,1,1,8],[3,1,3,8],[4,1,4,8],[5,1,5,8],[7,1,7,8],[8,1,8,8]]}
[]
[null,{"$f":"+Instructions!$A$3 & \"Existing LHC Property\"","v":"2025 QAP Underwriting Application v1.1Existing LHC Property"}]
[]
[null,"Project Name & Location:"]
[null,{"$f":"'Project Description'!E84 &\" - \" & 'Project Description'!E86 & \", Louisiana\"","v":" - , Louisiana"}]
[null,{"$f":"'Project Description'!E87 &\" Parish\"","v":"Select Parish"}]
[]
[null,"Submitted by:"]
[null,{"$f":"'Project Description'!E36","v":0}]
[]
[null,"Exising LHC Property Naritive:"]
[]
[]
[]
[]
[]
[]
[]
[]
[]
[]
[]
[]
[]
[]
[null,"Project Name:"]
[null,"Type of LHC Funding:"]
[null,"Total LHC Funding:"]
[null,"Total Units:"]
[null,"Total Buildings:"]
[null,"Year Funded:"]
[null,"Original Contact Name:"]

{"sheet":"Financing Cert","index":35,"n_rows":198,"n_cols":21,"rows_kept":198,"cut":false,"hidden":false,"merged":[[52,1,52,10],[196,4,196,6],[197,4,197,6],[168,1,168,9],[177,2,177,3],[74,3,74,8],[76,3,76,8],[78,3,78,4],[82,2,82,10],[83,2,83,10],[84,2,84,10],[85,2,85,10],[86,2,86,10],[90,1,90,10],[150,1,150,10],[20,2,20,3],[9,1,9,11],[178,2,178,3],[179,2,179,3],[182,2,182,3],[68,3,68,4],[69,3,69,4],[70,3,70,4],[14,2,14,3],[15,2,15,3],[16,2,16,3],[21,2,21,3],[11,2,11,3],[12,2,12,3],[23,2,23,6],[24,2,24,6],[3,0,3,11],[7,15,7,20],[17,2,17,3],[18,2,18,3],[19,2,19,3],[7,1,7,11]]}
[]
[]
[{"$f":"+Instructions!A3","v":"2025 QAP Underwriting Application v1.1"}]
[{"$f":"TRIM('Project Description'!E84)&\" (\"&TRIM('Project Description'!E86)&\" LA), \"&'Project Description'!E50","v":" ( LA), "},null,null,null,null,null,null,null,null,null,null,null,null,null,null,"NEED MORE RESEARCH ABOUT HOW THIS IS FILLED OUT / USED AT TIME OF APPLICATION"]
[]
["Financing Certification (At Time of Application)"]
[]
[null,"A.  Source of Funds",null,null,null,null,null,null,null,null,null,null,null,null,null,{"$f":"\"Permanent Sources of Funds from \"&'Project Description'!A510","v":"Permanent Sources of Funds from Section 19"}]
[null,null,null,null,null,null,null,null,null,null,null,null,null,null,null,{"$f":"+'Project Description'!B512","v":"New LHC Risk Sharing First Mortgage Loan"},null,null,null,null,{"$f":"+'Project Description'!H512","v":0}]
[null,"List Total Source of Funds (including grants but excluding construction loans to be paid by permanent sources of",null,null,null,null,null,null,null,null,null,null,null,null,null,{"$f":"+'Project Description'!B513","v":"Other Loan With Must-Pay Debt Service"},null,null,null,null,{"$f":"+'Project Description'!H513","v":0}]
[null,"funds) for the Project anticipated as of the Project's Placed in Service Date.",null,null,null,null,null,null,null,null,null,null,null,null,null,{"$f":"+'Project Description'!B514","v":"Non-LHC loan #2 (identify lender):"},null,null,null,null,{"$f":"+'Project Description'!H514","v":0}]
[null,null,"Name of Lender or",null,null,null,"Annual",null,"Interest Rate",null,"Amortization",null,null,null,null,{"$f":"+'Project Description'!B515","v":"LHC HOME Loan"},null,null,null,null,{"$f":"+'Project Description'!H515","v":0}]
[null,null,"Source of Funds",null,"Amount of Funds",null,"Debt Service",null,"of Loan",null,"Period (Years)",null,null,null,null,{"$f":"+'Project Description'!B516","v":"LHC NHTF Loan"},null,null,null,null,{"$f":"+'Project Description'!H516","v":0}]
[null,null,null,null,null,null,null,null,null,null,null,null,null,null,null,{"$f":"+'Project Description'!B517","v":"CDBG-DR Gap Financing Loan"},null,null,null,null,{"$f":"+'Project Description'!H517","v":0}]
[null,"1.  ",{"$f":"+'Project Description'!E314","v":0},null,{"$f":"+'Project Description'!E313:F313","v":0},null,{"$f":"+'Project Description'!E329","v":0},null,{"$f":"+'Project Description'!E320","v":0},null,{"$f":"+'Project Description'!G324","v":0},null,null,null,null,{"$f":"+'Project Description'!B518","v":"Deferred Developer Fee"},null,null,null,null,{"$f":"+'Project Description'!H518","v":0}]
[null,"2.  ",{"$f":"+'Project Description'!E339","v":"Missing"},null,{"$f":"+'Project Description'!E338:F338","v":0},null,{"$f":"+'Project Description'!E354","v":0},null,{"$f":"+'Project Description'!E345","v":0},null,{"$f":"+'Project Description'!G349","v":0},null,null,null,null,{"$f":"+'Project Description'!B519","v":"Federal Historic Tax Credits and Equity"},null,null,null,null,{"$f":"+'Project Description'!H519","v":0}]
[null,"3.  ","LHC Risk Sharing Loan",null,{"$f":"+U9","v":0},null,{"$f":"+'Project Description'!E304","v":0},null,{"$f":"+'Project Description'!E298","v":0},null,{"$f":"+'Project Description'!G300","v":0},null,null,null,null,{"$f":"+'Project Description'!B520","v":"State Historic Tax Credits and Equity"},null,null,null,null,{"$f":"+'Project Description'!H520","v":0}]
[null,"4.  ","LHC HOME / NHTF",null,{"$f":"+U12+U13","v":0},null,null,null,null,null,null,null,null,null,null,{"$f":"+'Project Description'!B521","v":"Estimated LIHTC Equity Proceeds"},null,null,null,null,{"$f":"+'Project Description'!H521","v":0}]
[null,"5.  ","CDBG-DR",null,{"$f":"+U14","v":0},null,null,null,null,null,null,null,null,null,null,{"$f":"+'Project Description'!B522","v":"Donated / Volunteer Labor"},null,null,null,null,{"$f":"+'Project Description'!H522","v":0}]
[null,"6.  ","Deferred Developer Fee",null,{"$f":"+U15","v":0},null,null,null,null,null,null,null,null,null,null,{"$f":"+'Project Description'!B523","v":"Donated Materials"},null,null,null,null,{"$f":"+'Project Description'!H523","v":0}]
[null,"7.  ","Donated Items",null,{"$f":"+U19+U20+U21","v":0},null,null,null,null,null,null,null,null,null,null,{"$f":"+'Project Description'!B524","v":"Donated Land Value"},null,null,null,null,{"$f":"+'Project Description'!H524","v":0}]
[null,"8.  ","Other",null,{"$f":"+U26-I24-I25-SUM(E14:E21)","v":0},null,null,null,null,null,null,null,null,null,null,{"$f":"+'Project Description'!B525","v":"Other Permanent Debt"},null,null,null,null,{"$f":"+'Project Description'!H525","v":0}]
[null,null,null,null,null,null,null,null,null,null,null,null,null,null,null,{"$f":"+'Project Description'!B526","v":"#2 (Explain)"},null,null,null,null,{"$f":"+'Project Description'!H526","v":0}]
[null,"9.  ","Proceeds from Low-Income Tax Credits",null,null,null,null,null,{"$f":"+'Project Description'!E432","v":0},null,null,null,null,null,null,{"$f":"+'Project Description'!B527","v":"#3 (Explain)"},null,null,null,null,{"$f":"+'Project Description'!H527","v":0}]
[null,"10.  ","Proceeds from Historic Tax Credits",null,null,null,null,null,{"$f":"+'Project Description'!E418+'Project Description'!E425","v":0}]
[null,null,null,null,null,null,null,null,null,null,null,null,null,null,null,null,null,null,null,null,{"$f":"+'Project Description'!H529","v":0}]
[null,"Total Source of Funds:",null,null,null,null,null,null,{"$f":"SUM(E15:E22)+I24+I25","v":0}]
[]
[null,"Total Annual Debt Service Cost",null,null,null,null,{"$f":"SUM(G15:G22)","v":0}]
[]
[null,"Estimated Placed in Service Date",null,null,null,null,null,null,{"$f":"+'Project Description'!H274","v":"00:00:00"}]
[]
[null,"Specify items which vary from terms contained in the later of the certifications in the Taxpayer's Application"]
[null,"or in the certifications as of the Allocation/Reservation of tax credits:"]
[]
[null,null,null,null,"Application/Reservation Date",null,null,null,"Placed-in-Service Date"]
[]
[null,"Land Costs",null,null,{"$f":"+'Development Costs'!C14+'Development Costs'!C15","v":0},null,null,null,0]
[null,"TDC",null,null,{"$f":"+'Development Costs'!D140","v":0},null,null,null,0]
[null,"TDC/Unit",null,null,{"$f":"+E39/'Unit Mix and Rents'!F41","v":{"$error":"#DIV/0!"}},null,null,null,0]
[null,"Soft Costs/Unit",null,null,{"$f":"+I155/'Unit Mix and Rents'!F41","v":{"$error":"#DIV/0!"}},null,null,null,0]
[null,"1st Mortgage Principal",null,null,{"$f":"+E15","v":0},null,null,null,0]
[null,null,"Interest",null,{"$f":"+I15","v":0},null,null,null,0]
[null,null,"Term",null,{"$f":"+K15","v":0},null,null,null,0]
[null,"2nd Mortgage Principal",null,null,{"$f":"+E16","v":0},null,null,null,0]
[null,null,"Interest",null,{"$f":"+I16","v":0},null,null,null,0]
[null,null,"Term",null,{"$f":"+K16","v":0},null,null,null,0]
[null,"Deferred Developer Fee",null,null,{"$f":"+'Project Description'!E412","v":0},null,null,null,0]
[null,"Developer Fee Paid",null,null,{"$f":"+'Development Costs'!D133-E48","v":0},null,null,null,0]
[null,"Gross Equity",null,null,{"$f":"+Syndication!J26","v":0},null,null,null,0]
[null,"Net Equity",null,null,{"$f":"+Syndication!J39","v":0},null,null,null,0]
[]
[null,"B.  Syndication Information"]
[]
[null,"Provide the following information concerning syndication from sale of tax credits:"]
[]
[null,"I.  ","Syndication Proceeds to be Received During Credit Period:"]
[null,null,null,null,null,null,null,null,null,null,null,null,null,null,null,{"$f":"+I24","v":0},"Total LIHTC Proceeds (Line A.5)"]
[null,null,null," 1:",{"$f":"+Syndication!J47","v":0},null,null,"6:",{"$f":"+Syndication!J52","v":0},null,null,null,null,null,null,{"$f":"SUM(E58:E64)+SUM(I58:I64)","v":0},"Total of LIHTC installments 1-10"]
[null,null,null," 2:",{"$f":"+Syndication!J48","v":0},null,null,"7:",{"$f":"+Syndication!J53","v":0}]
[null,null,null," 3:",{"$f":"+Syndication!J49","v":0},null,null,"8:",{"$f":"+Syndication!J54","v":0}]
[null,null,null," 4:",{"$f":"+Syndication!J50","v":0},null,null,"9:",{"$f":"+Syndication!J55","v":0}]
[null,null,null," 5:",{"$f":"+Syndication!J51","v":0},null,null,"10:",{"$f":"+Syndication!J56","v":0}]
[]
[null,"II.","Historic Rehabilitation Credit Proceeds:",null,null,null,null,null,{"$f":"+I25","v":0},null,null,null,null,null,null,{"$f":"+I65","v":0},"Total Historic Credit Proceeds"]
[]
[null,null,"Syndication Proceeds to be Received During Credit Period:"]
[]
[null,null,"Year 1:",0]
[null,null,"Year 2:",0,null,null,null,null,null,null,null,null,null,null,null,{"$f":"SUM(D69:E71)","v":0},"Total of years 1-3"]
[null,null,"Year 3:",{"$f":"+I65-D70-D69","v":0}]
[]
[null,"III.","Information Concerning Syndicator"]
[]
[null,null,"Name:",{"$f":"+Syndication!E12","v":0}]
[]
[null,null,"Address:",{"$f":"Syndication!E13&\" \"&Syndication!E14","v":" "}]
[]
[null,null,"Telephone:",{"$f":"+Syndication!E16","v":0}]
[]
[null,"IV.","Specify all operating and/or credit guarantees required by Syndicator:"]
[]
[null,null,"x"]
[null,null,"x"]
[null,null,"x"]
[null,null,"x"]
[null,null,"x"]
[]
[null,"V.","Attach evidence of syndication from Syndicator."]
[]
[null,"C.  Subsidies"]
[]
[null,"The following constitutes the full extent of all Federal, State and local subsidies which apply (or which the"]
[null,"Taxpayer expects to apply) with respect to the Project as of the date the reservation/allocation of tax credits"]
[null,"were made and as of the Project's Placed in Service Date."]
[]
[null,null,null,null,"Reservation Date",null,"Allocation Date",null,"Placed In Service Date"]
[]
[null,"I.  ","Non Repayable Grants"]
[]
[null,"(a)","CDBG (State)",null,0,null,0,null,0]
[null,"(b)","CDBG (Local)",null,0,null,0,null,0]
[null,"(c)","HOME",null,0,null,0,null,0]
[null,"(d)","Rental Rehab",null,0,null,0,null,0]
[null,"(e)","State",null,0,null,0,null,0]
[null,"(f)","Local",null,0,null,0,null,0]
[null,"(g)","Other",null,0,null,0,null,0]
[null,null,"TOTAL",null,{"$f":"SUM(E101:E107)","v":0},null,{"$f":"SUM(G101:G107)","v":0},null,{"$f":"SUM(I101:I107)","v":0}]
[]
[null,"II.","Secondary Financing"]
[]
[null,"(a)","CDBG (State)",null,0,null,0,null,0]
[null,"(b)","CDBG (Local)",null,0,null,0,null,0]
[null,"(c)","HOME",null,0,null,0,null,0]
[null,"(d)","HOPE VI",null,0,null,0,null,0]
[null,"(e)","State",null,0,null,0,null,0]
[null,"(f)","Local",null,0,null,0,null,0]
[null,"(g)","Other",null,0,null,0,null,0]
[null,"(h)","Other",null,0,null,0,null,0]
[null,"(I)","Other",null,0,null,0,null,0]
[null,null,"TOTAL",null,{"$f":"SUM(E112:E120)","v":0},null,{"$f":"SUM(G112:G120)","v":0},null,{"$f":"SUM(I112:I120)","v":0}]
[]
[null,"III.","Value Other Subsidies"]
[]
[null,"(a)","Tax Abatement",null,0,null,0,null,0]
[null,"(b)","Historic Rehab Credit",null,0,null,0,null,0]
[null,"(c)","Land Donation",null,0,null,0,null,0]
[null,"(d)","Other",null,0,null,0,null,0]
[null,null,"TOTAL",null,{"$f":"SUM(E125:E128)","v":0},null,{"$f":"SUM(G125:G128)","v":0},null,{"$f":"SUM(I125:I128)","v":0}]
[]
[null,"IV.","Credit Enhancements"]
[]
[null,"(a)","FHA Section #",null,0,null,0,null,0]
[null,"(b)","Private Mortgage Insurance",null,0,null,0,null,0]
[null,"(c)","Letters of Credit",null,0,null,0,null,0]
[null,"(d)","Other",null,0,null,0,null,0]
[]
[null,"V.","Rental Assistance Anticipated"]
[]
[null,"(a)","Tenant Based"]
[null,null,"(i)  Section 8",null,0,null,0,null,0]
[null,null,"(ii) Other",null,0,null,0,null,0]
[null,null,"(iii) Other",null,0,null,0,null,0]
[]
[null,"(b)","Project Based"]
[null,null,"(i)  Section 8",null,0,null,0,null,0]
[null,null,"(ii)  RD/RA",null,0,null,0,null,0]
[null,null,"(iii) State PBA",null,0,null,0,null,0]
[null,null,"(iv) Other",null,0,null,0,null,0]
[]
[null,"D.  Uses"]
[null,null,null,null,null,null,null,null," Amount"]
[null,null,null,"Rehabilitation Hard Costs",null,null,null,null,{"$f":"+'Development Costs'!C24","v":0}]
[null,null,null,"Construction Hard Costs",null,null,null,null,{"$f":"+'Development Costs'!D18+'Development Costs'!D28-I153-I161","v":0}]
[null,null,null,"Total Soft Costs",null,null,null,null,{"$f":"+'Development Costs'!D38+'Development Costs'!D52+'Development Costs'!D59+'Development Costs'!D63+'Development Costs'!D77+'Development Costs'!D86+'Development Costs'!D92+'Development Costs'!D97+'Development Costs'!D106+'Development Costs'!D111+'Development Costs'!D133-I165-I166","v":0}]
[null,null,null,"Acquisition Costs:"]
[null,null,null,"Land Only",null,null,null,null,{"$f":"+'Development Costs'!C14+'Development Costs'!C15","v":0}]
[null,null,null,"Buildings Only",null,null,null,null,{"$f":"+'Development Costs'!D12-I157","v":0}]
[null,null,null,"Other (please describe)",null,null,null,null,0]
[null,null,null,"Other Fund Uses NOT in Basis",null,null,null,null,0]
[null,null,null,"Demolition",null,null,null,null,{"$f":"+'Development Costs'!C29","v":0}]
[null,null,null,"Other (please describe)",null,null,null,null,{"$f":"+I163-SUM(I153:I161)","v":0}]
[null,null,null,"Total Development Costs",null,null,null,null,{"$f":"+'Development Costs'!D140-I165-I166","v":0}]
[null,null,null,"Temporary Contraction Loan Pay off",null,null,null,null,0]
[null,null,null,"Initial Operating  Reserve",null,null,null,null,{"$f":"+'Development Costs'!C99","v":0}]
[null,null,null,"Initial Deposit to Replacement Reserve",null,null,null,null,{"$f":"+'Development Costs'!C101","v":0}]
[null,null,null,null,"Total Use of Funds",null,null,null,{"$f":"SUM(I163:I166)","v":0}]
[]
[null,"E.  Funds Available for Cash Requirements"]
[]
[null,"15.  ","Sources of Cash:"]
[null,null,"(a)  Syndication Proceeds",null,{"$f":"+I24+I25","v":0},null,0,null,0]
[null,null,"(b)  Owner Contribution",null,0,null,0,null,0]
[null,null,"(c)  Other",null,0,null,0,null,0]
[null,null,"Subtotal",null,{"$f":"SUM(E172:E174)","v":0},null,{"$f":"SUM(G172:G174)","v":0},null,{"$f":"SUM(I172:I174)","v":0}]
[]
[null,"16.","Source of Fees and Grants:"]
[null,null,"Home Funds",null,0,null,0,null,0]
[null,null,"Other",null,0,null,0,null,0]
[null,null,"Other",null,0,null,0,null,0]
[null,null,"Subtotal",null,{"$f":"SUM(E178:E180)","v":0},null,{"$f":"SUM(G178:G180)","v":0},null,{"$f":"SUM(I178:I180)","v":0}]
[]
[null,"17.","TOTAL CASH, FEES & GRANTS",null,{"$f":"+E175+E181","v":0},null,{"$f":"+G175+G181","v":0},null,{"$f":"+I175+I181","v":0}]
[]
[null,"The undersigned hereby certifies under penalty of perjury that the information contained in this"]
[null,"Financing Certification is true and correct as of ____________________________, ________."]
[]
[null,"WITNESS this signature on the _____________ day of ______________________, ________."]
[]
[null,null,null,null,null,"By:"]
[]
[null,null,null,null,null,"Title:"]
[null,"WITNESSES"]
[]
[]
[]
[]
[null,null,null,null,"NOTARY"]

{"sheet":"Demand Cert","index":36,"n_rows":117,"n_cols":9,"rows_kept":117,"cut":false,"hidden":false,"merged":[[57,4,57,5],[1,1,1,8],[3,1,3,8],[4,1,4,8],[6,1,19,8],[21,1,21,8],[22,1,23,8],[25,1,25,8],[34,1,35,8],[43,1,44,8],[45,2,45,5],[54,1,55,8],[59,1,59,2],[59,3,59,4],[60,1,60,2],[60,3,60,4],[61,1,61,2],[61,3,61,4],[62,1,62,2],[62,3,62,4],[63,1,63,2],[63,3,63,4],[64,1,64,2],[64,3,64,4],[102,1,102,2],[66,1,67,8],[68,2,68,4],[77,1,78,8],[79,2,79,4],[87,1,88,8],[89,1,89,2],[91,1,92,8],[93,1,94,8],[96,1,97,8],[98,1,98,2],[100,1,101,8],[104,1,105,8],[106,3,106,4],[106,6,106,7],[107,3,107,4],[107,6,107,7]]}
[]
[null,"CERTIFICATION OF DEMAND FOR NEW UNITS"]
[]
[null,"The undersigned duly authorized representative of the qualified housing consultant hereby certifies the following in connection with the market analysis conducted"]
[null,"(1) Market Area: The Project is located in the following market area, as described in the attached market analysis."]
[null,"(Please provide a detailed description)"]
[]
[]
[]
[]
[]
[]
[]
[]
[]
[]
[]
[]
[]
[]
[]
[null,"(2) Market Area: A briefer Description of the Market (e.g. Bunkie City Limits)"]
[]
[]
[]
[null,"(3) The Market Study contains data and critical analysis which supports or includes the following:"]
[null,null,"I","II","III","IV","V","VI","VIII"]
[null,"Unit Size","Project Configuration No. of Units","Total Market Area Units by Unit Size","Substandard Units by Unit Size in Market Area","Vacancy Rate in Market Area by Unit Size","Projected Need by Unit Size for New Units in Area","Need by Unit Size for Units at 50% AMI","Need by Unit Size for Units at 60% AMI"]
[null,"Efficiency",0,0,0,0,0,0,0]
[null,"1 BR",0,0,0,0,0,0,0]
[null,"2 BR",0,0,0,0,0,0,0]
[null,"3 BR",0,0,0,0,0,0,0]
[null,"4 BR",0,0,0,0,0,0,0]
[]
[null,"(4) The Vacancy rate of subsidized housing and market rate housing and market rents for non-subsidized housing for the market area by unit size are as follows:"]
[]
[null,"Unit Size","Vacancy Rate (Subsidized)","Vacancy Rate (Market)","Market Rents (Non Subsidized)"]
[null,"Efficiency",0,0,0]
[null,"1 BR",0,0,0]
[null,"2 BR",0,0,0]
[null,"3 BR",0,0,0]
[null,"4 BR",0,0,0]
[]
[null,"(5) The numbers of households in the market area which are income eligible and which can afford to pay tax credit rents for each unit by bedroom size are as follows:"]
[]
[null,null,"Household Income Levels"]
[null,"Unit Size","0-30%","31-40%","41-50%","51-60%"]
[null,"Efficiency",0,0,0,0]
[null,"1 BR",0,0,0,0]
[null,"2 BR",0,0,0,0]
[null,"3 BR",0,0,0,0]
[null,"4 BR",0,0,0,0]
[null,"Total",{"$f":"SUM(C48:C52)","v":0},{"$f":"SUM(D48:D52)","v":0},{"$f":"SUM(E48:E52)","v":0},{"$f":"SUM(F48:F52)","v":0}]
[]
[null,"(6) Based upon the Market Study's conclusions, the Project can be expected to be occupied at the percentage specified below with the number of months following the completion date as follows:"]
[]
[]
[null,"Expected Completion Date:",null,null,"00:00:00"]
[]
[null,"Percentage Occupancy",null,"Months After Completion"]
[null,0.1,null,0]
[null,0.5,null,0]
[null,0.75,null,0]
[null,0.9,null,0]
[null,1,null,0]
[]
[null,"(7) The Market Study supports the number of Special Needs households who are expected to occupy units in the Project. Based upon the Market Study, Special Needs households at 50% of AMI or less will occupy the following unit sizes in the number specified:"]
[]
[null,null,"Household at or below 50% AMI"]
[null,"Unit Size","Elderly","Homeless","Handicapped"]
[null,"Efficiency",0,0,0]
[null,"1 BR",0,0,0]
[null,"2 BR","N/A",0,0]
[null,"3 BR","N/A",0,0]
[null,"4 BR","N/A",0,0]
[]
[]
[null,"(8) The Market Study supports the number of Special Needs households who are expected to occupy units in the Project. Based upon the Market Study, Special Needs households at 60% of AMI or less will occupy the following unit sizes in the number specified:"]
[]
[null,null,"Household at or below 60% AMI"]
[null,"Unit Size","Elderly","Homeless","Handicapped"]
[null,"Efficiency",0,0,0]
[null,"1 BR",0,0,0]
[null,"2 BR","N/A",0,0]
[null,"3 BR","N/A",0,0]
[null,"4 BR","N/A",0,0]
[]
[null,"(9) Give the total number of households on the PHA waiting list for the market area given above:"]
[]
[null,0]
[]
[null,"(10) Name the governmental unit responsible for permitting construction in the market area given above:"]
[]
[null,"xx"]
[]
[]
[null,"(11) How many units have been permitted by the above-referenced government unit for construction in the market area given above:"]
[]
[null,0]
[]
[null,"(12) The information in Line 11 above is as of what date?:"]
[]
[null,"00:00:00"]
[]
[null,"(13) Indicate the average operating expenses per unit per year for subsidized housing and for market rate (non-subsidized) housing:"]
[]
[null,null,null,"Subsidized",null,null,"Non-Subsidized"]
[null,"Operating Expenses",null,0,null,"/unit/year",0,null,"/unit/year"]
[]
[]
[null,null,null,null,"Witness my signature on this day, the "]
[]
[null,null,null,null,"day of"]
[]
[]
[null,null,null,null,"By:"]
[null,null,null,null,null,"Signature"]

{"sheet":"Parishes","index":37,"n_rows":84,"n_cols":34,"rows_kept":84,"cut":false,"hidden":false,"merged":[[6,27,6,32],[80,1,80,10],[81,1,81,10],[82,1,82,10],[6,4,6,8],[6,9,6,13],[6,14,6,18],[6,20,6,21]]}
[null,null,null,null,null,null,null,null,null,null,null,null,null,null,null,null,null,null,null,null,null,null,null,null,null,null,null,{"$f":"COLUMN(AB1)","v":28},{"$f":"COLUMN(AC1)","v":29},30,31,32,33]
[]
[{"$f":"+Instructions!A3","v":"2025 QAP Underwriting Application v1.1"}]
[]
[]
[]
[null,null,null,null,"FY2025 FMR",null,null,null,null,"2024 Low HOME Rent",null,null,null,null,"2024 High HOME Rent",null,null,null,null,"Section 8 Income Limits","FFIEC",null,null,null,null,null,null,"2019 QAP Demographic Data"]
["Parish","50% 2024 AMI","FEMA 2017","HUD 2017","0BR","1BR","2BR","3BR","4BR","0BR","1BR","2BR","3BR","4BR","0BR","1BR","2BR","3BR","4BR",2025,"MSA for AMI Purposes",2024,"MSA for AMI Purposes","Cost Area for TDC Limit Purposes","Previously Unfunded by LHC","TIER 1 or TIER 2 PARISH","4+ Housing Priorities","Percent Population Who are Elderly","Percent Population Who are Disabled","% ROHUs Experiencing >30% Housing Cost Burden","% of Total Population  in Poverty","% Pop'n of Persons < 5 Years in Poverty","Median Household Income"]
["Select"]
["Acadia",{"$f":"T10/2","v":34600},"Yes","Yes",619,688,903,1088,1197,557,625,751,867,967,557,626,822,1006,1128,69200,"Lafayette MSA",82000,"Lafayette MSA","Lafayette",null,null,null,0.1462136821761145,0.1853826952377865,0.51929499072356211,0.21544489795918367,0.29075591985428051,40492]
["Allen",{"$f":"T11/2","v":32600},"Yes","No",666,783,903,1119,1318,575,615,738,853,951,615,679,822,1043,1180,65200,"nonmetro portion of LOUISIANA",61100,"nonmetro portion of LOUISIANA","Lake Charles",null,null,null,0.15412786846924065,0.20569411764705883,0.49583333333333335,0.16629638383360906,0.28219346888478125,42176]
["Ascension",45850,"Yes","Yes",1063,1081,1222,1528,2023,776,831,998,1153,1286,990,1062,1276,1465,1615,91700,"Baton Rouge MSA",86800,"Baton Rouge MSA","Baton Rouge",null,null,null,0.11605066776351686,0.12121954930434635,0.4042462239954403,0.11695530419039078,0.17866791965229648,74748,"Is part of the FFIEC Baton Rouge MSA"]
["Assumption",38600,"No","No",805,830,926,1298,1532,646,692,831,960,1071,820,880,995,1213,1334,77200,"Baton Rouge MSA",86800,"Baton Rouge MSA","Lafayette",null,null,null,0.16463441283160701,0.195184335861704,0.62854686156491835,0.15706504893061152,0.22403433476394849,48656]
["Avoyelles",27350,"Yes","No",672,694,911,1178,1274,520,557,668,772,862,641,651,847,970,1063,54700,"nonmetro portion of LOUISIANA",61100,"nonmetro portion of LOUISIANA","Alexandria",null,null,null,0.16435089426937582,0.18967587034813926,0.53499854777810052,0.23709271842063026,0.40925925925925927,36763]
["Beauregard",42500,"Yes","No",677,765,974,1216,1610,727,741,865,1096,1222,727,741,865,1126,1468,85000,"nonmetro portion of LOUISIANA",61100,"nonmetro portion of LOUISIANA","Lake Charles",null,null,null,0.15776818405377344,0.20778498094098663,0.48296593186372744,0.17266067726330339,0.19517270079067831,47350,"Awarded in 2024 funding round"]
["Bienville",27650,"Yes","No",666,785,903,1265,1516,520,557,668,772,862,615,704,822,970,1063,55300,"nonmetro portion of LOUISIANA",61100,"nonmetro portion of LOUISIANA","Shreveport",null,null,{"$f":"+A16","v":"Bienville"},0.19846443575257133,0.21115892565662561,0.4726749760306807,0.25289317507418396,0.39243498817966904,34077]
["Bossier",40850,"Yes","No",767,892,1017,1317,1394,658,705,846,978,1091,779,898,1073,1238,1361,81700,"Shreveport-Bossier City MSA",75200,"Shreveport-Bossier City MSA","Shreveport",null,null,null,0.13850657926140431,0.12202731979890755,0.50420954162768938,0.16381886508215915,0.25349591676921357,52145]
["Caddo",40850,"Yes","No",767,892,1017,1317,1394,658,705,846,978,1091,779,898,1073,1238,1361,81700,"Shreveport-Bossier City MSA",75200,"Shreveport-Bossier City MSA","Shreveport",null,null,null,0.15924307660443943,0.15196656654465562,0.57179013816102908,0.23401783356691649,0.41002782351939127,40391]
["Calcasieu",45550,"Yes","No",871,877,1144,1383,1517,691,740,888,1027,1146,835,840,1080,1302,1433,91100,"Lake Charles MSA",83100,"Lake Charles MSA","Lake Charles",null,null,null,0.14419908127172923,0.15487272930865115,0.50004495190146547,0.16802636029148005,0.28617269544924157,48219]
["Caldwell",43400,"Yes","No",671,694,910,1096,1328,551,590,708,818,913,698,722,901,1031,1131,86800,"nonmetro portion of LOUISIANA",61100,"nonmetro portion of LOUISIANA","Monroe",null,null,null,0.1817,0.14698718627554802,0.48391812865497075,0.26217506631299736,0.47359154929577463,31933]
["Cameron",45550,"No","No",871,877,1144,1383,1517,691,740,888,1027,1146,835,840,1080,1302,1433,91100,"Lake Charles MSA",83100,"Lake Charles MSA","Lake Charles",null,null,null,0.16705847781369379,0.16270836406549638,0.50331125827814571,8.6803001324113574E-2,3.6111111111111108E-2,60194]
["Catahoula",32850,"Yes","No",666,688,903,1265,1318,592,635,762,880,982,615,722,822,1110,1192,65700,"nonmetro portion of LOUISIANA",61100,"nonmetro portion of LOUISIANA","Alexandria",null,null,null,0.16806053365193149,0.13053121880891649,0.55919854280510017,0.21812527765437584,0.36239316239316238,34470,"Awarded in 2018"]
["Claiborne",23650,"Yes","No",666,754,903,1088,1318,520,557,668,772,862,615,626,822,970,1063,47300,"nonmetro portion of LOUISIANA",61100,"nonmetro portion of LOUISIANA","Shreveport",null,null,{"$f":"+A23","v":"Claiborne"},0.18108738340697103,0.19828128274994761,0.60948667966211822,0.29922088860812801,0.49238578680203043,26877,"Awarded in 2024 funding round"]
["Concordia",27000,"No","No",666,688,903,1265,1318,520,557,668,772,862,615,626,822,970,1063,54000,"nonmetro portion of LOUISIANA",61100,"nonmetro portion of LOUISIANA","Alexandria",null,null,null,0.17223294245707782,0.12425677163620348,0.59678256357031656,0.31234131802627224,0.43851132686084143,30028]
["Desoto",40850,"Yes","No",767,892,1017,1317,1394,658,705,846,978,1091,779,898,1073,1238,1361,81700,"Shreveport-Bossier City MSA",75200,"Shreveport-Bossier City MSA","Shreveport",null,null,null,0.17994404358710056,0.17389692250648869,0.47979797979797978,0.26313446126447015,0.37877889745109661,41443]
["East Baton Rouge",45850,"Yes","Yes",1063,1081,1222,1528,2023,776,831,998,1153,1286,990,1062,1276,1465,1615,91700,"Baton Rouge MSA",86800,"Baton Rouge MSA","Baton Rouge",null,null,null,0.1349270564609216,0.13828843971455193,0.52608386638237381,0.19110614617217705,0.29372926003215766,51436]
["East Carroll",19950,"Yes","No",666,688,903,1265,1364,520,557,668,772,862,615,626,822,970,1063,39900,"nonmetro portion of LOUISIANA",61100,"nonmetro portion of LOUISIANA","Monroe",null,null,{"$f":"+A27","v":"East Carroll"},0.12940694178737361,0.14405930675215387,0.58678500986193294,0.48171956609079952,0.90476190476190477,20795]
["East Feliciana",45850,"Yes","No",1063,1081,1222,1528,2023,776,831,998,1153,1286,990,1062,1276,1465,1615,91700,"Baton Rouge MSA",86800,"Baton Rouge MSA","Baton Rouge",null,null,null,0.17695494297550249,0.16028854383176427,0.45683802133850632,0.17931287892706227,0.20041753653444677,46964,"Awarded in 2011"]
["Evangeline",29050,"Yes","No",666,728,903,1196,1197,520,557,668,772,862,615,669,822,970,1063,58100,"nonmetro portion of LOUISIANA",61100,"nonmetro portion of LOUISIANA","Lafayette",null,null,{"$f":"+A29","v":"Evangeline"},0.15564444444444445,0.23021247514910537,0.51372212692967412,0.26416273474361779,0.3537326388888889,31745]
["Franklin",29350,"Yes","No",666,775,903,1149,1197,520,557,668,772,862,615,702,822,970,1063,58700,"nonmetro portion of LOUISIANA",61100,"nonmetro portion of LOUISIANA","Monroe",null,null,null,0.17338630567000196,0.17776378613778268,0.65714285714285714,0.28800378330093007,0.54877192982456136,34722]
["Grant",39000,"Yes","No",710,762,1000,1354,1513,603,646,776,897,1001,674,757,988,1132,1244,78000,"Alexandria MSA",74200,"Alexandria MSA","Alexandria","Grant",null,null,0.1511768661735037,0.16988416988416988,0.46779661016949153,0.20189558403049879,0.28593508500772796,40577]
["Iberia",37750,"Yes","No",714,732,920,1174,1545,556,595,715,825,921,685,690,906,1040,1141,75500,"Lafayette MSA",82000,"Lafayette MSA","Lafayette",null,null,null,0.14442505385433424,0.1603192325187115,0.48148148148148145,0.20365032290251947,0.33784800601956361,44504]
["Iberville",39500,"Yes","No",785,816,903,1265,1516,645,690,828,956,1067,796,818,918,1210,1331,79000,"Baton Rouge MSA",86800,"Baton Rouge MSA","Baton Rouge",null,null,null,0.15563673691202223,0.19531828898619064,0.51435185185185184,0.19285086830191228,0.35563561502830676,47128]
["Jackson",30200,"Yes","No",666,816,903,1260,1291,530,567,681,786,877,615,718,822,989,1084,60400,"nonmetro portion of LOUISIANA",61100,"nonmetro portion of LOUISIANA","Monroe",null,null,null,0.19345536609829489,0.22816556786515327,0.56231003039513683,0.25384929826951902,0.45989304812834225,36394]
["Jefferson",44900,"No","No",1071,1236,1478,1889,2217,760,814,977,1128,1258,968,1038,1248,1433,1579,89800,"New Orleans - Metairie MSA",82700,"New Orleans - Metairie MSA","New Orleans",null,null,null,0.16196989735446346,0.13642976540434607,0.53695564651412464,0.16317063657826777,0.3106768005790807,50868]
["Jefferson Davis",40300,"Yes","No",657,690,903,1265,1516,635,672,822,961,1073,635,672,822,1158,1338,80600,"nonmetro portion of LOUISIANA",61100,"nonmetro portion of LOUISIANA","Lake Charles",null,null,null,0.16379557395319216,0.19086760946247694,0.51703255109765334,0.19604334103406762,0.24283071230342276,40744]
["Lafayette",42350,"Yes","Yes",740,930,1052,1322,1736,701,796,956,1105,1232,701,921,1034,1344,1545,84700,"Lafayette MSA",82000,"Lafayette MSA","Lafayette",null,null,null,0.12372077404189229,0.11668573365535359,0.48702783119851956,0.16637407447150981,0.22201231031750868,53950]
["Lafourche",37850,"No","No",786,934,1146,1382,1519,697,746,896,1035,1155,757,900,1117,1312,1444,75700,"Houma-Thibodeaux MSA",79600,"Houma-Thibodeaux MSA","Lafayette",null,null,null,0.14738258317025441,0.1690623072177668,0.46699875466998753,0.16012852986121287,0.18523316062176165,52705]
["Lasalle",46100,"Yes","No",682,705,925,1192,1350,578,620,743,859,958,629,639,840,1076,1189,92200,"nonmetro portion of LOUISIANA",61100,"nonmetro portion of LOUISIANA","Alexandria",{"$f":"+A39","v":"Lasalle"},null,null,0.16718017414601474,0.15573952250720674,0.37867647058823528,0.24836940409131336,0.47854077253218885,34712]
["Lincoln",35400,"Yes","No",721,772,978,1284,1599,558,598,718,830,926,678,727,906,1044,1145,70800,"nonmetro portion of LOUISIANA",61100,"nonmetro portion of LOUISIANA","Shreveport",null,null,null,0.12981740154830024,0.13607574691318533,0.68336823212683218,0.31170918309604112,0.37908011869436203,34424]
["Livingston",45850,"Yes","Yes",1063,1081,1222,1528,2023,776,831,998,1153,1286,990,1062,1276,1465,1615,91700,"Baton Rouge MSA",86800,"Baton Rouge MSA","Baton Rouge",null,null,null,0.1313678006652273,0.13489794268325847,0.39470458445697476,0.13211655742167097,0.14271886427188643,60456]
["Madison",{"$f":"T42/2","v":25200},"Yes","No",684,688,903,1117,1516,520,557,668,772,862,621,626,822,970,1063,50400,"nonmetro portion of LOUISIANA",61100,"nonmetro portion of LOUISIANA","Monroe",null,null,null,0.13636363636363635,0.12888354379635197,0.52889539136795904,0.36442053988228129,0.625,29424]
["Morehouse",27050,"Yes","No",684,688,903,1188,1302,520,557,668,772,862,646,650,822,970,1063,54100,"nonmetro portion of LOUISIANA",61100,"nonmetro portion of LOUISIANA","Monroe",null,null,null,0.18139977177634081,0.15540487575448772,0.59721175584024111,0.27614141334696607,0.35116153430578068,31672]
["Natchitoches",36300,"Yes","No",704,783,1027,1273,1447,561,601,722,835,931,666,748,918,1052,1154,72600,"nonmetro portion of LOUISIANA",61100,"nonmetro portion of LOUISIANA","Shreveport",null,null,null,0.15909963893370208,0.15798946215243362,0.65967325881341354,0.31929005872483224,0.42243823410287568,29001]
["Orleans",44900,"No","No",1071,1236,1478,1889,2217,760,814,977,1128,1258,968,1038,1248,1433,1579,89800,"New Orleans - Metairie MSA",82700,"New Orleans - Metairie MSA","New Orleans",null,null,null,0.13824700784683472,0.13844829706135497,0.61096972944012862,0.25360609212125723,0.3980632889503718,38721]
["Ouachita",36700,"Yes","Yes",766,767,995,1276,1319,572,613,736,850,948,724,757,934,1071,1175,73400,"Monroe MSA",67400,"Monroe MSA","Monroe",null,null,null,0.14298134025429418,0.12950398917649869,0.56175399554926153,0.24521181053098953,0.43472010063797284,40081]
["Plaquemines",44900,"No","No",1071,1236,1478,1889,2217,760,814,977,1128,1258,968,1038,1248,1433,1579,89800,"New Orleans - Metairie MSA",82700,"New Orleans - Metairie MSA","New Orleans",null,null,null,0.12280926733350432,0.10459785463123693,0.43795936013834846,0.19260320354212787,0.24562500000000001,49635]
["Pointe Coupee",45850,"Yes","No",1063,1081,1222,1528,2023,776,831,998,1153,1286,990,1062,1276,1465,1615,91700,"Baton Rouge MSA",86800,"Baton Rouge MSA","Baton Rouge",null,null,null,0.19577028422612366,0.21102781791907516,0.42259414225941422,0.17496016389710903,0.20939183987682833,43964]
["Rapides",39000,"Yes","No",710,762,1000,1354,1513,603,646,776,897,1001,674,757,988,1132,1244,78000,"Alexandria MSA",74200,"Alexandria MSA","Alexandria",null,null,null,0.1581390066626287,0.17289409000262804,0.54672382118799756,0.1954712810094264,0.24755590515788292,42655]
["Red River",31700,"Yes","No",666,688,903,1135,1390,528,566,680,785,876,615,626,822,987,1081,63400,"nonmetro portion of LOUISIANA",61100,"nonmetro portion of LOUISIANA","Shreveport",null,null,null,0.17631548779089762,0.1497787095271372,0.44328097731239091,0.20420879379261697,0.15425531914893617,41510]
["Richland",34550,"Yes","No",722,727,954,1149,1358,522,560,672,776,866,645,649,846,975,1069,69100,"nonmetro portion of LOUISIANA",61100,"nonmetro portion of LOUISIANA","Monroe",null,null,null,0.16484795576895098,0.13661395442833324,0.48402948402948404,0.28211625196371559,0.53512233622730865,34745]
["Sabine",34300,"Yes","No",673,749,982,1183,1302,537,576,691,798,891,605,679,877,1004,1100,68600,"nonmetro portion of LOUISIANA",61100,"nonmetro portion of LOUISIANA","Shreveport",null,null,null,0.19983433423068958,0.14717394049072008,0.51730531520395551,0.19568885514215811,0.3553162853297443,40695]
["St. Bernard",44900,"No","No",1071,1236,1478,1889,2217,760,814,977,1128,1258,968,1038,1248,1433,1579,89800,"New Orleans - Metairie MSA",82700,"New Orleans - Metairie MSA","New Orleans",null,null,null,0.11125657354605366,0.13326630920464699,0.56604662114433713,0.19701378939828079,0.28026971562591613,45265]
["St. Charles",44900,"No","No",1071,1236,1478,1889,2217,760,814,977,1128,1258,968,1038,1248,1433,1579,89800,"New Orleans - Metairie MSA",82700,"New Orleans - Metairie MSA","New Orleans","St. Charles",null,null,0.12731376118950083,0.11485487062258679,0.49053814311058547,0.12203905557909332,0.23946300343428037,64707]
["St. Helena",45850,"Yes","No",1063,1081,1222,1528,2023,776,831,998,1153,1286,990,1062,1276,1465,1615,91700,"Baton Rouge MSA",86800,"Baton Rouge MSA","Baton Rouge",{"$f":"+A55","v":"St. Helena"},null,null,0.17575411552003045,0.22446223594096654,0.44289693593314761,0.26449416342412452,0.35294117647058826,35254]
["St. James",47350,"Yes","No",704,741,972,1362,1458,681,715,940,1101,1228,681,715,940,1325,1408,94700,"nonmetro portion of LOUISIANA-St. James",82700,"nonmetro portion of LOUISIANA-St. James","New Orleans",null,null,null,0.17388875959972075,0.15647473560517039,0.46328124999999998,0.15586368977673326,0.2256838905775076,52055,"Is part of the FFIEC New Orleans MSA"]
["St. John",44900,"No","No",1071,1236,1478,1889,2217,760,814,977,1128,1258,968,1038,1248,1433,1579,89800,"New Orleans - Metairie MSA",82700,"New Orleans - Metairie MSA","New Orleans",null,null,null,0.13522322965683461,0.13719412724306687,0.52014541048167218,0.17855807868423512,0.30536793458940631,53628,"Awarded in 2024"]
["St. Landry",31400,"Yes","No",684,688,903,1155,1335,520,557,668,772,862,621,626,822,970,1063,62800,"nonmetro portion of LOUISIANA",61100,"nonmetro portion of LOUISIANA","Lafayette",null,null,{"$f":"+A58","v":"St. Landry"},0.15549174443646804,0.12830211553615808,0.59764705882352942,0.27923563777994159,0.49265062187045711,32163]
["St. Martin",42350,"Yes","No",740,930,1052,1322,1736,701,796,956,1105,1232,701,921,1034,1344,1545,84700,"Lafayette MSA",82000,"Lafayette MSA","Lafayette",null,null,null,0.14325952731817418,0.15090980642017879,0.45848119233498935,0.17655928976683694,0.29442060085836907,47279]
["St. Mary",35300,"No","No",762,767,1006,1314,1622,576,617,741,855,955,711,740,941,1078,1183,70600,"nonmetro portion of LOUISIANA",61100,"nonmetro portion of LOUISIANA","Lafayette",null,null,null,0.15978165772756667,0.17210802874584655,0.40916398713826369,0.19507932500922384,0.26030122193805061,41345,"Awarded in 2020"]
["St. Tammany",49000,"Yes","Yes",1071,1236,1478,1889,2217,760,814,977,1128,1258,968,1038,1248,1433,1579,98000,"SLIDELL-MANDEVILLE-COVINGTON, LA",99500,"SLIDELL-MANDEVILLE-COVINGTON, LA","New Orleans",null,null,null,0.16524010738319669,0.14162982294752455,0.52437403057832932,0.10773113062105451,0.16402044293015333,66539]
["Tangipahoa",40200,"Yes","Yes",846,851,1099,1364,1457,668,716,858,992,1107,829,834,1072,1256,1381,80400,"Only Parish in Hammond LA MSA",76300,"Only Parish in Hammond LA MSA","Baton Rouge",null,null,null,0.14282499029879706,0.20193832048668869,0.56844637591184233,0.21915909564325659,0.33856722276741902,45901]
["Tensas",27450,"No","No",666,816,903,1265,1318,520,557,668,772,862,615,626,822,970,1063,54900,"nonmetro portion of LOUISIANA",61100,"nonmetro portion of LOUISIANA","Monroe",null,null,null,0.21840285055543912,0.12286976646328635,0.64968152866242035,0.38039133179044815,0.61111111111111116,21906,"Awarded in 2024"]
["Terrebonne",37850,"No","No",786,934,1146,1382,1519,697,746,896,1035,1155,757,900,1117,1312,1444,75700,"Houma-Thibodeaux MSA",79600,"Houma-Thibodeaux MSA","Lafayette",null,null,null,0.13311576322003768,0.15296360268124826,0.46420047732696895,0.20052580401195663,0.29157345264727813,47650]
["Union",36700,"Yes","No",766,767,995,1276,1319,572,613,736,850,948,724,757,934,1071,1175,73400,"Monroe MSA",67400,"Monroe MSA","Monroe",null,null,{"$f":"+A65","v":"Union"},0.20007099436482229,0.1586228794339109,0.56365503080082136,0.21998717008797655,0.3723916532905297,38916]
["Vermilion",40150,"Yes","Yes",619,816,903,1193,1197,568,700,822,970,1082,568,732,822,1091,1095,80300,"Lafayette MSA",82000,"Lafayette MSA","Lafayette",null,null,null,0.14575291188315703,0.1602134608262348,0.42160540135033758,0.1785690029883184,0.26546906187624753,49266]
["Vernon",35900,"Yes","No",875,881,1156,1484,1592,607,651,781,902,1007,770,794,993,1139,1251,71800,"nonmetro portion of LOUISIANA",61100,"nonmetro portion of LOUISIANA","Alexandria",null,null,null,0.11540091704234579,0.17226330724911859,0.46678537186686753,0.1686903642655678,0.22478516508367255,46620,"Awarded in 2020"]
["Washington",32450,"Yes","Yes",785,816,903,1265,1459,520,557,668,772,862,656,704,822,970,1063,64900,"nonmetro portion of LOUISIANA",61100,"nonmetro portion of LOUISIANA","Baton Rouge",null,null,{"$f":"+A68","v":"Washington"},0.17959482443109648,0.23211122323130395,0.57748417285989539,0.26259696458684656,0.40791863421721758,32962]
["Webster",26600,"Yes","No",666,688,903,1193,1197,520,557,668,772,862,615,626,822,970,1063,53200,"Shreveport-Bossier City MSA",75200,"Shreveport-Bossier City MSA","Shreveport",null,null,null,0.19121943910296432,0.16924178860124833,0.58441208198489747,0.24853906089809308,0.47867298578199052,30891]
["West Baton Rouge",45850,"Yes","No",1063,1081,1222,1528,2023,776,831,998,1153,1286,990,1062,1276,1465,1615,91700,"Baton Rouge MSA",86800,"Baton Rouge MSA","Baton Rouge",null,null,null,0.14009718629986675,0.14921455397165126,0.47709163346613548,0.17880419382261264,0.29965947786606129,60902]
["West Carroll",38500,"Yes","No",666,688,903,1196,1256,570,610,732,846,943,615,626,822,1066,1170,77000,"nonmetro portion of LOUISIANA",61100,"nonmetro portion of LOUISIANA","Monroe",null,null,null,0.186357991839631,0.13161097070111391,0.44919786096256686,0.2196813495782568,0.31811023622047246,37304]
["West Feliciana",45850,"Yes","No",1063,1081,1222,1528,2023,776,831,998,1153,1286,990,1062,1276,1465,1615,91700,"Baton Rouge MSA",86800,"Baton Rouge MSA","Baton Rouge",null,null,null,0.14099895941727367,0.11504058307106178,0.36341463414634145,0.12456518138148087,0.22150882825040127,55647]
["Winn",34000,"Yes","No",666,816,903,1265,1318,535,573,687,794,886,615,725,822,999,1095,68000,"nonmetro portion of LOUISIANA",61100,"nonmetro portion of LOUISIANA","Alexandria",null,null,{"$f":"+A73","v":"Winn"},0.18002870617182695,0.21070677160445725,0.59527559055118107,0.27311055590256089,0.32689832689832687,29472]
[]
["Count",{"$f":"COUNT(B9:B74)","v":64},{"$f":"COUNTIF(C9:C74,\"Yes\")","v":51},{"$f":"COUNTIF(D9:D74,\"Yes\")","v":10}]
[]
[]
[]
[]
["Source:"]
["HUD Exchange HOME Rent Limits","https://www.huduser.gov/portal/datasets/home-datasets/files/HOME_RentLimits_State_AZ_2024.pdf",null,null,null,null,null,null,null,null,null,"Effective June 1,2024"]
["FFIEC Median Family Income Report","https://www.ffiec.gov/pdf/msa24inc.pdf",null,null,null,null,null,null,null,null,null,"Last Modified  8/30/24"]
["HUD User Fair Market Rents","https://www.huduser.gov/portal/datasets/fmr.html#year2025",null,null,null,null,null,null,null,null,null,"Effective October 1,2024"]
["Section 8 Income Limits","https://www.huduser.gov/portal/datasets/il.html#data_2025",null,null,null,null,null,null,null,null,null,"Effective April 1, 2025"]

{"sheet":"HUD TDC Data","index":38,"n_rows":38,"n_cols":10,"rows_kept":38,"cut":false,"hidden":false,"merged":[]}
[]
[]
[{"$f":"+Instructions!A3","v":"2025 QAP Underwriting Application v1.1"}]
[]
["HUD 2024 Unit Total Development Cost Limits Database"]
[]
["Area","Development Type","Index","0 BR TDC","1 BR TDC","2 BR TDC","3 BR TDC","4 BR TDC","5 BR TDC","6 BR TDC"]
["Alexandria","Detached / Semi-Detached",{"$f":"A8&\" \"&B8","v":"Alexandria Detached / Semi-Detached"},189946,246451,295485,353332,416823,457190,493765]
["Alexandria","Row House","Alexandria Row House",164154,215653,262716,323299,385122,425561,462707]
["Alexandria","Walkup","Alexandria Walkup",148235,201398,254416,334680,414094,466090,517330]
["Alexandria","Elevator","Alexandria Elevator",153222,214511,275800,367734,459667,520956,582245]
["Baton Rouge","Detached / Semi-Detached",{"$f":"A12&\" \"&B12","v":"Baton Rouge Detached / Semi-Detached"},192990,250235,299913,358464,422736,463615,500548]
["Baton Rouge","Row House","Baton Rouge Row House",167482,219776,267505,328760,391384,432370,469949]
["Baton Rouge","Walkup","Baton Rouge Walkup",152046,206801,261412,344058,425863,479464,532316]
["Baton Rouge","Elevator","Baton Rouge Elevator",155694,217971,280249,373665,467081,529359,591637]
["Lafayette","Detached / Semi-Detached","Lafayette Detached / Semi-Detached",195259,253241,303557,362882,428000,469411,506866]
["Lafayette","Row House","Lafayette Row House",169184,222105,270429,332518,395951,437457,475541]
["Lafayette","Walkup","Lafayette Walkup",153284,208399,263367,346565,428903,482839,536009]
["Lafayette","Elevator","Lafayette Elevator",157518,220526,283533,378044,472555,535562,598569]
["Lake Charles","Detached / Semi-Detached","Lake Charles Detached / Semi-Detached",192990,250235,299913,358464,422736,463615,500548]
["Lake Charles","Row House","Lake Charles Row House",167482,219776,267505,328760,391384,432370,469949]
["Lake Charles","Walkup","Lake Charles Walkup",152046,206801,261412,344058,425863,479464,532316]
["Lake Charles","Elevator","Lake Charles Elevator",155694,217971,280249,373665,467081,529359,591637]
["Monroe","Detached / Semi-Detached","Monroe Detached / Semi-Detached",192305,249637,299388,358124,422583,463555,500757]
["Monroe","Row House","Monroe Row House",165663,217824,265539,327100,389837,430855,468586]
["Monroe","Walkup","Monroe Walkup",148985,202245,255355,335784,415332,467388,518661]
["Monroe","Elevator","Monroe Elevator",155113,217158,279204,372271,465339,527385,589430]
["New Orleans","Detached / Semi-Detached","New Orleans Detached / Semi-Detached",199618,258890,310326,370970,437537,479869,518155]
["New Orleans","Row House","New Orleans Row House",172976,227077,276477,339946,404791,447222,486151]
["New Orleans","Walkup","New Orleans Walkup",156737,213098,269309,354388,438588,493745,548119]
["New Orleans","Elevator","New Orleans Elevator",161035,225448,289862,386483,483104,547517,611931]
["Shreveport","Detached / Semi-Detached","Shreveport Detached / Semi-Detached",192036,249094,298610,357003,421096,461852,498736]
["Shreveport","Row House","Shreveport Row House",166244,218297,265842,326969,389395,430237,467726]
["Shreveport","Walkup","Shreveport Walkup",150450,204499,258403,339996,420738,473621,525746]
["Shreveport","Elevator","Shreveport Elevator",154914,216880,278846,371794,464743,526708,588674]
[]
["Source:"]
["https://www.hud.gov/sites/dfiles/PIH/documents/2024_Units_TDC_Limits.pdf"]

{"sheet":"AMI Rents","index":39,"n_rows":131,"n_cols":10,"rows_kept":131,"cut":false,"hidden":true,"merged":[]}
[]
[]
[{"$f":"+Instructions!A3","v":"2025 QAP Underwriting Application v1.1"}]
[]
[{"$f":"\"AMI Rents for \"&'Unit Mix and Rents'!A4","v":"AMI Rents for  ( LA), "}]
[]
["4 Person AMI",{"$f":"+'Project Description'!H707","v":"Parish required on Row 82"},"at 100% AMI",null,{"$f":"+'Project Description'!E87","v":"Select"}]
[]
[0.2,"of AMI Will Be Used for These Calculations"]
["1 Person",{"$f":"ROUND(B13*I10/50,0)* 50","v":{"$error":"#VALUE!"}},"0BR",{"$f":"B10","v":{"$error":"#VALUE!"}},{"$f":"D10*0.3/12","v":{"$error":"#VALUE!"}},{"$f":"C10&\" Gross Rent\"","v":"0BR Gross Rent"},null,null,0.7]
["2 Person",{"$f":"ROUND(B13*I11/50,0)* 50","v":{"$error":"#VALUE!"}},"1BR",{"$f":"(B10+B11)/2","v":{"$error":"#VALUE!"}},{"$error":"#VALUE!"},"1BR Gross Rent",null,null,0.8]
["3 Person",{"$f":"ROUND(B13*I12/50,0)* 50","v":{"$error":"#VALUE!"}},"2BR",{"$f":"B12","v":{"$error":"#VALUE!"}},{"$error":"#VALUE!"},"2BR Gross Rent",null,null,0.9]
["4 Person",{"$f":"ROUND(B7*A9,0)","v":{"$error":"#VALUE!"}},"3BR",{"$f":"(B13+B14)/2","v":{"$error":"#VALUE!"}},{"$error":"#VALUE!"},"3BR Gross Rent",null,null,1]
["5 Person",{"$f":"ROUND(B13*I14/50,0)* 50","v":{"$error":"#VALUE!"}},"4BR",{"$f":"B15","v":{"$error":"#VALUE!"}},{"$error":"#VALUE!"},"4BR Gross Rent",null,null,1.08]
["6 Person",{"$f":"ROUND(B13*I15/50,0)* 50","v":{"$error":"#VALUE!"}},"5BR",{"$f":"(B17+B16)/2","v":{"$error":"#VALUE!"}},{"$error":"#VALUE!"},"5BR Gross Rent",null,null,1.1599999999999999]
["7 Person",{"$f":"ROUND(B13*I16/50,0)* 50","v":{"$error":"#VALUE!"}},null,null,null,null,null,null,{"$f":"+I15+8%","v":1.24}]
["8 Person",{"$f":"ROUND(B13*I17/50,0)* 50","v":{"$error":"#VALUE!"}},null,null,null,null,null,null,{"$f":"+I16+8%","v":1.32}]
[]
[{"$f":"\"Gross Rents (Rents + Tenant Paid Utilities) at 30% of \"&TEXT(A9,\"0%\")&\" of AMI\"","v":"Gross Rents (Rents + Tenant Paid Utilities) at 30% of 20% of AMI"}]
["0BR","1BR","2BR","3BR","4BR","5BR"]
[{"$f":"ROUNDDOWN(E10,I21)","v":{"$error":"#VALUE!"}},{"$f":"ROUNDDOWN(E11,I21)","v":{"$error":"#VALUE!"}},{"$f":"ROUNDDOWN(E12,I21)","v":{"$error":"#VALUE!"}},{"$f":"ROUNDDOWN(E13,I21)","v":{"$error":"#VALUE!"}},{"$f":"ROUNDDOWN(E14,I21)","v":{"$error":"#VALUE!"}},{"$f":"ROUNDDOWN(E15,I21)","v":{"$error":"#VALUE!"}},null,null,0,"2 = round down to penny; 0 = round down to dollar"]
[]
[0.3,"of AMI Will Be Used for These Calculations"]
["1 Person",{"$f":"ROUND(B27*I24/50,0)* 50","v":{"$error":"#VALUE!"}},"0BR",{"$f":"B24","v":{"$error":"#VALUE!"}},{"$f":"D24*0.3/12","v":{"$error":"#VALUE!"}},{"$f":"C24&\" Gross Rent\"","v":"0BR Gross Rent"},null,null,0.7]
["2 Person",{"$f":"ROUND(B27*I25/50,0)* 50","v":{"$error":"#VALUE!"}},"1BR",{"$f":"(B24+B25)/2","v":{"$error":"#VALUE!"}},{"$error":"#VALUE!"},"1BR Gross Rent",null,null,0.8]
["3 Person",{"$f":"ROUND(B27*I26/50,0)* 50","v":{"$error":"#VALUE!"}},"2BR",{"$f":"B26","v":{"$error":"#VALUE!"}},{"$error":"#VALUE!"},"2BR Gross Rent",null,null,0.9]
["4 Person",{"$f":"ROUND(B7*A23,0)","v":{"$error":"#VALUE!"}},"3BR",{"$f":"(B27+B28)/2","v":{"$error":"#VALUE!"}},{"$error":"#VALUE!"},"3BR Gross Rent",null,null,1]
["5 Person",{"$f":"ROUND(B27*I28/50,0)* 50","v":{"$error":"#VALUE!"}},"4BR",{"$f":"B29","v":{"$error":"#VALUE!"}},{"$error":"#VALUE!"},"4BR Gross Rent",null,null,1.08]
["6 Person",{"$f":"ROUND(B27*I29/50,0)* 50","v":{"$error":"#VALUE!"}},"5BR",{"$f":"(B31+B30)/2","v":{"$error":"#VALUE!"}},{"$error":"#VALUE!"},"5BR Gross Rent",null,null,1.1599999999999999]
["7 Person",{"$f":"ROUND(B27*I30/50,0)* 50","v":{"$error":"#VALUE!"}},null,null,null,null,null,null,{"$f":"+I29+8%","v":1.24}]
["8 Person",{"$f":"ROUND(B27*I31/50,0)* 50","v":{"$error":"#VALUE!"}},null,null,null,null,null,null,{"$f":"+I30+8%","v":1.32}]
[]
[{"$f":"\"Gross Rents (Rents + Tenant Paid Utilities) at 30% of \"&TEXT(A23,\"0%\")&\" of AMI\"","v":"Gross Rents (Rents + Tenant Paid Utilities) at 30% of 30% of AMI"}]
["0BR","1BR","2BR","3BR","4BR","5BR"]
[{"$f":"ROUNDDOWN(E24,I35)","v":{"$error":"#VALUE!"}},{"$f":"ROUNDDOWN(E25,I35)","v":{"$error":"#VALUE!"}},{"$f":"ROUNDDOWN(E26,I35)","v":{"$error":"#VALUE!"}},{"$f":"ROUNDDOWN(E27,I35)","v":{"$error":"#VALUE!"}},{"$f":"ROUNDDOWN(E28,I35)","v":{"$error":"#VALUE!"}},{"$f":"ROUNDDOWN(E29,I35)","v":{"$error":"#VALUE!"}}]
[]
[0.4,"of AMI Will Be Used for These Calculations"]
["1 Person",{"$f":"ROUND(B41*I38/50,0)* 50","v":{"$error":"#VALUE!"}},"0BR",{"$f":"B38","v":{"$error":"#VALUE!"}},{"$f":"D38*0.3/12","v":{"$error":"#VALUE!"}},{"$f":"C38&\" Gross Rent\"","v":"0BR Gross Rent"},null,null,0.7]
["2 Person",{"$f":"ROUND(B41*I39/50,0)* 50","v":{"$error":"#VALUE!"}},"1BR",{"$f":"(B38+B39)/2","v":{"$error":"#VALUE!"}},{"$error":"#VALUE!"},"1BR Gross Rent",null,null,0.8]
["3 Person",{"$f":"ROUND(B41*I40/50,0)* 50","v":{"$error":"#VALUE!"}},"2BR",{"$f":"B40","v":{"$error":"#VALUE!"}},{"$error":"#VALUE!"},"2BR Gross Rent",null,null,0.9]
["4 Person",{"$f":"ROUND(B7*A37,0)","v":{"$error":"#VALUE!"}},"3BR",{"$f":"(B41+B42)/2","v":{"$error":"#VALUE!"}},{"$error":"#VALUE!"},"3BR Gross Rent",null,null,1]
["5 Person",{"$f":"ROUND(B41*I42/50,0)* 50","v":{"$error":"#VALUE!"}},"4BR",{"$f":"B43","v":{"$error":"#VALUE!"}},{"$error":"#VALUE!"},"4BR Gross Rent",null,null,1.08]
["6 Person",{"$f":"ROUND(B41*I43/50,0)* 50","v":{"$error":"#VALUE!"}},"5BR",{"$f":"(B45+B44)/2","v":{"$error":"#VALUE!"}},{"$error":"#VALUE!"},"5BR Gross Rent",null,null,1.1599999999999999]
["7 Person",{"$f":"ROUND(B41*I44/50,0)* 50","v":{"$error":"#VALUE!"}},null,null,null,null,null,null,{"$f":"+I43+8%","v":1.24}]
["8 Person",{"$f":"ROUND(B41*I45/50,0)* 50","v":{"$error":"#VALUE!"}},null,null,null,null,null,null,{"$f":"+I44+8%","v":1.32}]
[]
[{"$f":"\"Gross Rents (Rents + Tenant Paid Utilities) at 30% of \"&TEXT(A37,\"0%\")&\" of AMI\"","v":"Gross Rents (Rents + Tenant Paid Utilities) at 30% of 40% of AMI"}]
["0BR","1BR","2BR","3BR","4BR","5BR"]
[{"$f":"ROUNDDOWN(E38,I49)","v":{"$error":"#VALUE!"}},{"$f":"ROUNDDOWN(E39,I49)","v":{"$error":"#VALUE!"}},{"$f":"ROUNDDOWN(E40,I49)","v":{"$error":"#VALUE!"}},{"$f":"ROUNDDOWN(E41,I49)","v":{"$error":"#VALUE!"}},{"$f":"ROUNDDOWN(E42,I49)","v":{"$error":"#VALUE!"}},{"$f":"ROUNDDOWN(E43,I49)","v":{"$error":"#VALUE!"}}]
[]
[0.5,"of AMI Will Be Used for These Calculations"]
["1 Person",{"$f":"ROUND(B55*I52/50,0)* 50","v":{"$error":"#VALUE!"}},"0BR",{"$f":"B52","v":{"$error":"#VALUE!"}},{"$f":"D52*0.3/12","v":{"$error":"#VALUE!"}},{"$f":"C52&\" Gross Rent\"","v":"0BR Gross Rent"},null,null,0.7]
["2 Person",{"$f":"ROUND(B55*I53/50,0)* 50","v":{"$error":"#VALUE!"}},"1BR",{"$f":"(B52+B53)/2","v":{"$error":"#VALUE!"}},{"$error":"#VALUE!"},"1BR Gross Rent",null,null,0.8]
["3 Person",{"$f":"ROUND(B55*I54/50,0)* 50","v":{"$error":"#VALUE!"}},"2BR",{"$f":"B54","v":{"$error":"#VALUE!"}},{"$error":"#VALUE!"},"2BR Gross Rent",null,null,0.9]
["4 Person",{"$f":"ROUND(B7*A51,0)","v":{"$error":"#VALUE!"}},"3BR",{"$f":"(B55+B56)/2","v":{"$error":"#VALUE!"}},{"$error":"#VALUE!"},"3BR Gross Rent",null,null,1]
["5 Person",{"$f":"ROUND(B55*I56/50,0)* 50","v":{"$error":"#VALUE!"}},"4BR",{"$f":"B57","v":{"$error":"#VALUE!"}},{"$error":"#VALUE!"},"4BR Gross Rent",null,null,1.08]
["6 Person",{"$f":"ROUND(B55*I57/50,0)* 50","v":{"$error":"#VALUE!"}},"5BR",{"$f":"(B59+B58)/2","v":{"$error":"#VALUE!"}},{"$error":"#VALUE!"},"5BR Gross Rent",null,null,1.1599999999999999]
["7 Person",{"$f":"ROUND(B55*I58/50,0)* 50","v":{"$error":"#VALUE!"}},null,null,null,null,null,null,{"$f":"+I57+8%","v":1.24}]
["8 Person",{"$f":"ROUND(B55*I59/50,0)* 50","v":{"$error":"#VALUE!"}},null,null,null,null,null,null,{"$f":"+I58+8%","v":1.32}]
[]
[{"$f":"\"Gross Rents (Rents + Tenant Paid Utilities) at 30% of \"&TEXT(A51,\"0%\")&\" of AMI\"","v":"Gross Rents (Rents + Tenant Paid Utilities) at 30% of 50% of AMI"}]
["0BR","1BR","2BR","3BR","4BR","5BR"]
[{"$f":"ROUNDDOWN(E52,I63)","v":{"$error":"#VALUE!"}},{"$f":"ROUNDDOWN(E53,I63)","v":{"$error":"#VALUE!"}},{"$f":"ROUNDDOWN(E54,I63)","v":{"$error":"#VALUE!"}},{"$f":"ROUNDDOWN(E55,I63)","v":{"$error":"#VALUE!"}},{"$f":"ROUNDDOWN(E56,I63)","v":{"$error":"#VALUE!"}},{"$f":"ROUNDDOWN(E57,I63)","v":{"$error":"#VALUE!"}}]
[]
[0.6,"of AMI Will Be Used for These Calculations"]
["1 Person",{"$f":"ROUND(B69*I66/50,0)* 50","v":{"$error":"#VALUE!"}},"0BR",{"$f":"B66","v":{"$error":"#VALUE!"}},{"$f":"D66*0.3/12","v":{"$error":"#VALUE!"}},{"$f":"C66&\" Gross Rent\"","v":"0BR Gross Rent"},null,null,0.7]
["2 Person",{"$f":"ROUND(B69*I67/50,0)* 50","v":{"$error":"#VALUE!"}},"1BR",{"$f":"(B66+B67)/2","v":{"$error":"#VALUE!"}},{"$error":"#VALUE!"},"1BR Gross Rent",null,null,0.8]
["3 Person",{"$f":"ROUND(B69*I68/50,0)* 50","v":{"$error":"#VALUE!"}},"2BR",{"$f":"B68","v":{"$error":"#VALUE!"}},{"$error":"#VALUE!"},"2BR Gross Rent",null,null,0.9]
["4 Person",{"$f":"ROUND(B7*A65,0)","v":{"$error":"#VALUE!"}},"3BR",{"$f":"(B69+B70)/2","v":{"$error":"#VALUE!"}},{"$error":"#VALUE!"},"3BR Gross Rent",null,null,1]
["5 Person",{"$f":"ROUND(B69*I70/50,0)* 50","v":{"$error":"#VALUE!"}},"4BR",{"$f":"B71","v":{"$error":"#VALUE!"}},{"$error":"#VALUE!"},"4BR Gross Rent",null,null,1.08]
["6 Person",{"$f":"ROUND(B69*I71/50,0)* 50","v":{"$error":"#VALUE!"}},"5BR",{"$f":"(B73+B72)/2","v":{"$error":"#VALUE!"}},{"$error":"#VALUE!"},"5BR Gross Rent",null,null,1.1599999999999999]
["7 Person",{"$f":"ROUND(B69*I72/50,0)* 50","v":{"$error":"#VALUE!"}},null,null,null,null,null,null,{"$f":"+I71+8%","v":1.24}]
["8 Person",{"$f":"ROUND(B69*I73/50,0)* 50","v":{"$error":"#VALUE!"}},null,null,null,null,null,null,{"$f":"+I72+8%","v":1.32}]
[]
[{"$f":"\"Gross Rents (Rents + Tenant Paid Utilities) at 30% of \"&TEXT(A65,\"0%\")&\" of AMI\"","v":"Gross Rents (Rents + Tenant Paid Utilities) at 30% of 60% of AMI"}]
["0BR","1BR","2BR","3BR","4BR","5BR"]
[{"$f":"ROUNDDOWN(E66,I77)","v":{"$error":"#VALUE!"}},{"$f":"ROUNDDOWN(E67,I77)","v":{"$error":"#VALUE!"}},{"$f":"ROUNDDOWN(E68,I77)","v":{"$error":"#VALUE!"}},{"$f":"ROUNDDOWN(E69,I77)","v":{"$error":"#VALUE!"}},{"$f":"ROUNDDOWN(E70,I77)","v":{"$error":"#VALUE!"}},{"$f":"ROUNDDOWN(E71,I77)","v":{"$error":"#VALUE!"}}]
[]
[0.7,"of AMI Will Be Used for These Calculations"]
["1 Person",{"$f":"ROUND(B83*I80/50,0)* 50","v":{"$error":"#VALUE!"}},"0BR",{"$f":"B80","v":{"$error":"#VALUE!"}},{"$f":"D80*0.3/12","v":{"$error":"#VALUE!"}},{"$f":"C80&\" Gross Rent\"","v":"0BR Gross Rent"},null,null,0.7]
["2 Person",{"$f":"ROUND(B83*I81/50,0)* 50","v":{"$error":"#VALUE!"}},"1BR",{"$f":"(B80+B81)/2","v":{"$error":"#VALUE!"}},{"$error":"#VALUE!"},"1BR Gross Rent",null,null,0.8]
["3 Person",{"$f":"ROUND(B83*I82/50,0)* 50","v":{"$error":"#VALUE!"}},"2BR",{"$f":"B82","v":{"$error":"#VALUE!"}},{"$error":"#VALUE!"},"2BR Gross Rent",null,null,0.9]
["4 Person",{"$f":"ROUND(B7*A79,0)","v":{"$error":"#VALUE!"}},"3BR",{"$f":"(B83+B84)/2","v":{"$error":"#VALUE!"}},{"$error":"#VALUE!"},"3BR Gross Rent",null,null,1]
["5 Person",{"$f":"ROUND(B83*I84/50,0)* 50","v":{"$error":"#VALUE!"}},"4BR",{"$f":"B85","v":{"$error":"#VALUE!"}},{"$error":"#VALUE!"},"4BR Gross Rent",null,null,1.08]
["6 Person",{"$f":"ROUND(B83*I85/50,0)* 50","v":{"$error":"#VALUE!"}},"5BR",{"$f":"(B87+B86)/2","v":{"$error":"#VALUE!"}},{"$error":"#VALUE!"},"5BR Gross Rent",null,null,1.1599999999999999]
["7 Person",{"$f":"ROUND(B83*I86/50,0)* 50","v":{"$error":"#VALUE!"}},null,null,null,null,null,null,{"$f":"+I85+8%","v":1.24}]
["8 Person",{"$f":"ROUND(B83*I87/50,0)* 50","v":{"$error":"#VALUE!"}},null,null,null,null,null,null,{"$f":"+I86+8%","v":1.32}]
[]
[{"$f":"\"Gross Rents (Rents + Tenant Paid Utilities) at 30% of \"&TEXT(A79,\"0%\")&\" of AMI\"","v":"Gross Rents (Rents + Tenant Paid Utilities) at 30% of 70% of AMI"}]
["0BR","1BR","2BR","3BR","4BR","5BR"]
[{"$f":"ROUNDDOWN(E80,I91)","v":{"$error":"#VALUE!"}},{"$f":"ROUNDDOWN(E81,I91)","v":{"$error":"#VALUE!"}},{"$f":"ROUNDDOWN(E82,I91)","v":{"$error":"#VALUE!"}},{"$f":"ROUNDDOWN(E83,I91)","v":{"$error":"#VALUE!"}},{"$f":"ROUNDDOWN(E84,I91)","v":{"$error":"#VALUE!"}},{"$f":"ROUNDDOWN(E85,I91)","v":{"$error":"#VALUE!"}}]
[]
[0.8,"of AMI Will Be Used for These Calculations"]
["1 Person",{"$f":"ROUND(B97*I94/50,0)* 50","v":{"$error":"#VALUE!"}},"0BR",{"$f":"B94","v":{"$error":"#VALUE!"}},{"$f":"D94*0.3/12","v":{"$error":"#VALUE!"}},{"$f":"C94&\" Gross Rent\"","v":"0BR Gross Rent"},null,null,0.7]
["2 Person",{"$f":"ROUND(B97*I95/50,0)* 50","v":{"$error":"#VALUE!"}},"1BR",{"$f":"(B94+B95)/2","v":{"$error":"#VALUE!"}},{"$error":"#VALUE!"},"1BR Gross Rent",null,null,0.8]
["3 Person",{"$f":"ROUND(B97*I96/50,0)* 50","v":{"$error":"#VALUE!"}},"2BR",{"$f":"B96","v":{"$error":"#VALUE!"}},{"$error":"#VALUE!"},"2BR Gross Rent",null,null,0.9]
["4 Person",{"$f":"ROUND(B7*A93,0)","v":{"$error":"#VALUE!"}},"3BR",{"$f":"(B97+B98)/2","v":{"$error":"#VALUE!"}},{"$error":"#VALUE!"},"3BR Gross Rent",null,null,1]
["5 Person",{"$f":"ROUND(B97*I98/50,0)* 50","v":{"$error":"#VALUE!"}},"4BR",{"$f":"B99","v":{"$error":"#VALUE!"}},{"$error":"#VALUE!"},"4BR Gross Rent",null,null,1.08]
["6 Person",{"$f":"ROUND(B97*I99/50,0)* 50","v":{"$error":"#VALUE!"}},"5BR",{"$f":"(B101+B100)/2","v":{"$error":"#VALUE!"}},{"$error":"#VALUE!"},"5BR Gross Rent",null,null,1.1599999999999999]
["7 Person",{"$f":"ROUND(B97*I100/50,0)* 50","v":{"$error":"#VALUE!"}},null,null,null,null,null,null,{"$f":"+I99+8%","v":1.24}]
["8 Person",{"$f":"ROUND(B97*I101/50,0)* 50","v":{"$error":"#VALUE!"}},null,null,null,null,null,null,{"$f":"+I100+8%","v":1.32}]
[]
[{"$f":"\"Gross Rents (Rents + Tenant Paid Utilities) at 30% of \"&TEXT(A93,\"0%\")&\" of AMI\"","v":"Gross Rents (Rents + Tenant Paid Utilities) at 30% of 80% of AMI"}]
["0BR","1BR","2BR","3BR","4BR","5BR"]
[{"$f":"ROUNDDOWN(E94,I105)","v":{"$error":"#VALUE!"}},{"$f":"ROUNDDOWN(E95,I105)","v":{"$error":"#VALUE!"}},{"$f":"ROUNDDOWN(E96,I105)","v":{"$error":"#VALUE!"}},{"$f":"ROUNDDOWN(E97,I105)","v":{"$error":"#VALUE!"}},{"$f":"ROUNDDOWN(E98,I105)","v":{"$error":"#VALUE!"}},{"$f":"ROUNDDOWN(E99,I105)","v":{"$error":"#VALUE!"}}]
[]
[1.2,"of AMI Will Be Used for These Calculations"]
["1 Person",{"$f":"ROUND(B111*I108/50,0)* 50","v":{"$error":"#VALUE!"}},"0BR",{"$f":"B108","v":{"$error":"#VALUE!"}},{"$f":"D108*0.3/12","v":{"$error":"#VALUE!"}},{"$f":"C108&\" Gross Rent\"","v":"0BR Gross Rent"},null,null,0.7]
["2 Person",{"$f":"ROUND(B111*I109/50,0)* 50","v":{"$error":"#VALUE!"}},"1BR",{"$f":"(B108+B109)/2","v":{"$error":"#VALUE!"}},{"$error":"#VALUE!"},"1BR Gross Rent",null,null,0.8]
["3 Person",{"$f":"ROUND(B111*I110/50,0)* 50","v":{"$error":"#VALUE!"}},"2BR",{"$f":"B110","v":{"$error":"#VALUE!"}},{"$error":"#VALUE!"},"2BR Gross Rent",null,null,0.9]
["4 Person",{"$f":"ROUND(B7*A107,0)","v":{"$error":"#VALUE!"}},"3BR",{"$f":"(B111+B112)/2","v":{"$error":"#VALUE!"}},{"$error":"#VALUE!"},"3BR Gross Rent",null,null,1]
["5 Person",{"$f":"ROUND(B111*I112/50,0)* 50","v":{"$error":"#VALUE!"}},"4BR",{"$f":"B113","v":{"$error":"#VALUE!"}},{"$error":"#VALUE!"},"4BR Gross Rent",null,null,1.08]
["6 Person",{"$f":"ROUND(B111*I113/50,0)* 50","v":{"$error":"#VALUE!"}},"5BR",{"$f":"(B115+B114)/2","v":{"$error":"#VALUE!"}},{"$error":"#VALUE!"},"5BR Gross Rent",null,null,1.1599999999999999]
["7 Person",{"$f":"ROUND(B111*I114/50,0)* 50","v":{"$error":"#VALUE!"}},null,null,null,null,null,null,{"$f":"+I113+8%","v":1.24}]
["8 Person",{"$f":"ROUND(B111*I115/50,0)* 50","v":{"$error":"#VALUE!"}},null,null,null,null,null,null,{"$f":"+I114+8%","v":1.32}]
[]
[{"$f":"\"Gross Rents (Rents + Tenant Paid Utilities) at 30% of \"&TEXT(A107,\"0%\")&\" of AMI\"","v":"Gross Rents (Rents + Tenant Paid Utilities) at 30% of 120% of AMI"}]
["0BR","1BR","2BR","3BR","4BR","5BR"]
[{"$f":"ROUNDDOWN(E108,I119)","v":{"$error":"#VALUE!"}},{"$f":"ROUNDDOWN(E109,I119)","v":{"$error":"#VALUE!"}},{"$f":"ROUNDDOWN(E110,I119)","v":{"$error":"#VALUE!"}},{"$f":"ROUNDDOWN(E111,I119)","v":{"$error":"#VALUE!"}},{"$f":"ROUNDDOWN(E112,I119)","v":{"$error":"#VALUE!"}},{"$f":"ROUNDDOWN(E113,I119)","v":{"$error":"#VALUE!"}}]
[]
[]
["Gross Rents","0BR","1BR","2BR","3BR","4BR"]
["120% AMI",{"$f":"+A119","v":{"$error":"#VALUE!"}},{"$f":"+B119","v":{"$error":"#VALUE!"}},{"$f":"+C119","v":{"$error":"#VALUE!"}},{"$f":"+D119","v":{"$error":"#VALUE!"}},{"$f":"+E119","v":{"$error":"#VALUE!"}}]
["20% AMI",{"$f":"+A21","v":{"$error":"#VALUE!"}},{"$f":"+B21","v":{"$error":"#VALUE!"}},{"$f":"+C21","v":{"$error":"#VALUE!"}},{"$f":"+D21","v":{"$error":"#VALUE!"}},{"$f":"+E21","v":{"$error":"#VALUE!"}}]
["30% AMI",{"$f":"+A35","v":{"$error":"#VALUE!"}},{"$f":"+B35","v":{"$error":"#VALUE!"}},{"$f":"+C35","v":{"$error":"#VALUE!"}},{"$f":"+D35","v":{"$error":"#VALUE!"}},{"$f":"+E35","v":{"$error":"#VALUE!"}}]
["40% AMI",{"$f":"+A49","v":{"$error":"#VALUE!"}},{"$f":"+B49","v":{"$error":"#VALUE!"}},{"$f":"+C49","v":{"$error":"#VALUE!"}},{"$f":"+D49","v":{"$error":"#VALUE!"}},{"$f":"+E49","v":{"$error":"#VALUE!"}}]
["50% AMI",{"$f":"+A63","v":{"$error":"#VALUE!"}},{"$f":"+B63","v":{"$error":"#VALUE!"}},{"$f":"+C63","v":{"$error":"#VALUE!"}},{"$f":"+D63","v":{"$error":"#VALUE!"}},{"$f":"+E63","v":{"$error":"#VALUE!"}}]
["60% AMI",{"$f":"+A77","v":{"$error":"#VALUE!"}},{"$f":"+B77","v":{"$error":"#VALUE!"}},{"$f":"+C77","v":{"$error":"#VALUE!"}},{"$f":"+D77","v":{"$error":"#VALUE!"}},{"$f":"+E77","v":{"$error":"#VALUE!"}}]
["70% AMI",{"$f":"+A91","v":{"$error":"#VALUE!"}},{"$f":"+B91","v":{"$error":"#VALUE!"}},{"$f":"+C91","v":{"$error":"#VALUE!"}},{"$f":"+D91","v":{"$error":"#VALUE!"}},{"$f":"+E91","v":{"$error":"#VALUE!"}}]
["80% AMI",{"$f":"+A105","v":{"$error":"#VALUE!"}},{"$f":"+B105","v":{"$error":"#VALUE!"}},{"$f":"+C105","v":{"$error":"#VALUE!"}},{"$f":"+D105","v":{"$error":"#VALUE!"}},{"$f":"+E105","v":{"$error":"#VALUE!"}}]
["Market","N/A","N/A","N/A","N/A","N/A"]

{"sheet":"WS Controls","index":40,"n_rows":50,"n_cols":5,"rows_kept":50,"cut":false,"hidden":true,"merged":[]}
[null,null,null,{"$f":"COUNTA(A7:A51)","v":44},"worksheets"]
[]
[{"$f":"+Instructions!A3","v":"2025 QAP Underwriting Application v1.1"}]
["Worksheet Controls"]
[]
["Worksheet Name","Hide?","Last User Row","Last User Column"]
["Import (Reality Check)","Yes"]
["Import (Data 2017)","Yes"]
["Import (Data 2018)","Yes"]
["Import (Instructions)","YES",{"$f":"1+ROW(Instructions!A39)","v":40},{"$f":"1+COLUMN(D49)","v":5}]
["Import (Controls 2017)","Yes"]
["Import (Controls 2018)","Yes"]
["Revision Log","YES",{"$f":"1+ROW('Revision Log'!A2126)","v":2127},{"$f":"1+COLUMN('Revision Log'!C1)","v":4}]
["Instructions",null,{"$f":"1+ROW(Instructions!A80)","v":81},{"$f":"1+COLUMN(Instructions!D1)","v":5}]
["Project Description",null,{"$f":"1+ROW('Project Description'!A1068)","v":1069},{"$f":"1+COLUMN('Project Description'!K1)","v":12}]
["Unit Mix and Rents",null,{"$f":"1+ROW('Unit Mix and Rents'!A79)","v":80},{"$f":"1+COLUMN('Unit Mix and Rents'!N1)","v":15}]
["Development Costs",null,{"$f":"1+ROW('Development Costs'!A387)","v":388},{"$f":"1+COLUMN('Development Costs'!H1)","v":9}]
["Basis Calculation",null,{"$f":"1+ROW('Basis Calculation'!A65)","v":66},{"$f":"1+COLUMN('Basis Calculation'!V1)","v":23}]
["Revenues and Expenses",null,{"$f":"1+ROW('Revenues and Expenses'!A113)","v":114},{"$f":"1+COLUMN('Basis Calculation'!G1)","v":8}]
["Proforma",null,{"$f":"1+ROW(Proforma!A55)","v":56},{"$f":"1+COLUMN(Proforma!AQ1)","v":44}]
["Selection Criteria",null,{"$f":"1+ROW('Selection Criteria'!A131)","v":132},{"$f":"1+COLUMN('Selection Criteria'!J1)","v":11}]
["Summary",null,{"$f":"1+ROW(Summary!A86)","v":87},{"$f":"1+COLUMN(Summary!I1)","v":10}]
["Checklist",null,{"$f":"1+ROW(Checklist!A429)","v":430},{"$f":"1+COLUMN(Checklist!D1)","v":5}]
["Serious Problems",null,{"$f":"1+ROW('Taxpayer Certification'!A49)","v":50},{"$f":"1+COLUMN('Taxpayer Certification'!D59)","v":5}]
["Reviewer Follow-Ups","Yes",{"$f":"1+ROW('Reviewer Follow-Ups'!A36)","v":37},{"$f":"1+COLUMN('Reviewer Follow-Ups'!D1)","v":5}]
["Development Team",null,{"$f":"1+ROW('Development Team'!A105)","v":106},{"$f":"1+COLUMN('Development Team'!G1)","v":8}]
["Syndication",null,{"$f":"1+ROW(Syndication!A188)","v":189},{"$f":"1+COLUMN(Syndication!L1)","v":13}]
["Taxpayer Certification",null,{"$f":"1+ROW('Taxpayer Certification'!A32)","v":33},{"$f":"1+COLUMN('Taxpayer Certification'!I1)","v":10}]
["Reserve Adequacy",null,{"$f":"1+ROW('Reserve Adequacy'!A33)","v":34},{"$f":"1+COLUMN('Reserve Adequacy'!R1)","v":19}]
["App 1 Owner Info",null,{"$f":"1+ROW('App 1 Owner Info'!A77)","v":78},{"$f":"1+COLUMN('App 1 Owner Info'!I1)","v":10}]
["App 2 Site Control",null,{"$f":"1+ROW('App 2 Site Control'!A69)","v":70},{"$f":"1+COLUMN('App 2 Site Control'!M1)","v":14}]
["App 3 Ownership History",null,{"$f":"1+ROW('App 3 Ownership History'!A44)","v":45},{"$f":"1+COLUMN('App 3 Ownership History'!G1)","v":8}]
["App 4 Zoning",null,{"$f":"1+ROW('App 4 Zoning'!A38)","v":39},{"$f":"1+COLUMN('App 4 Zoning'!E1)","v":6}]
["App 11 NP Participation",null,{"$f":"1+ROW('App 11 NP Participation'!A45)","v":46},{"$f":"1+COLUMN('App 11 NP Participation'!J1)","v":11}]
["App 13 NP Counsel Opinion",null,{"$f":"1+ROW('App 13 NP Counsel Opinion'!A47)","v":48},{"$f":"1+COLUMN('App 13 NP Counsel Opinion'!D1)","v":5}]
["App 34 Debarment",null,{"$f":"1+ROW('App 34 Debarment'!A38)","v":39},{"$f":"1+COLUMN('App 34 Debarment'!E1)","v":6}]
["App 35 Matching",null,{"$f":"1+ROW('App 35 Matching'!A26)","v":27},{"$f":"1+COLUMN('App 35 Matching'!G1)","v":8}]
["App 36 Environmental",null,{"$f":"1+ROW('App 36 Environmental'!A111)","v":112},{"$f":"1+COLUMN('App 36 Environmental'!I1)","v":10}]
["LHC-2 CEO Notification",null,{"$f":"1+ROW('LHC-2 CEO Notification'!A62)","v":63},{"$f":"1+COLUMN('LHC-2 CEO Notification'!D1)","v":5}]
["LHC-3 Developer Experience",null,{"$f":"1+ROW('LHC-3 Developer Experience'!A57)","v":58},{"$f":"1+COLUMN('LHC-3 Developer Experience'!I1)","v":10}]
["LHC-4 Management Experience",null,{"$f":"1+ROW('LHC-4 Management Experience'!A61)","v":62},{"$f":"1+COLUMN('LHC-4 Management Experience'!H1)","v":9}]
["Financing Cert",null,{"$f":"1+ROW('Financing Cert'!A200)","v":201},{"$f":"1+COLUMN('Financing Cert'!N1)","v":15}]
["Demand Cert",null,{"$f":"1+ROW('Demand Cert'!A143)","v":144},{"$f":"1+COLUMN('Demand Cert'!K1)","v":12}]
["Printing Options",null,{"$f":"1+ROW('Printing Options'!A45)","v":46},{"$f":"1+COLUMN('Printing Options'!G1)","v":8}]
["Parishes"]
["HUD TDC Data"]
["AMI Rents","Yes"]
["Controls","Yes"]
["WS Controls","Yes",{"$f":"1+ROW(A52)","v":53},{"$f":"1+COLUMN('Printing Options'!K1)","v":12}]
["QAP Reference","Yes"]